program: Orca
programVersion: 5.0.2
elementType: Cl F F F O O O O O O N N C C C C C C C C C C C C C C C C C C C C H H H H H H H H H H H H H H H H H H
charge: 0
multiplicity: 1
keywords: wb97x-d3
keywords: def2-TZVPP
keywords: def2/J RIJCOSX
keywords: DEFGRID2
keywords: scfconv7
keywords: smallprint printgap noloewdin
keywords: NOSOSCF
formula: C20H18ClF3N2O6
InChI: InChI=1/C20H18ClF3N2O6/c1-5-8-31-17(29)19(2,3)32-16(28)12-9-11(6-7-13(12)21)26-15(27)10-14(20(22,23)24)25(4)18(26)30/h5-7,9-10H,1,8H2,2-4H3
50 atoms
Cl 3.455352 -3.122085 -0.468712
F  -5.861006 2.111451 -0.409752
F  -6.565377 0.441888 -1.555011
F  -6.617287 0.351898 0.585482
O  3.919127 -0.31175 -0.199706
O  3.607589 1.776104 1.362347
O  -1.773249 -0.176707 1.717442
O  -2.27686 -1.586615 -2.561557
O  4.99997 3.031713 0.138817
O  2.543794 1.093669 -1.258057
N  -2.003677 -0.842756 -0.432052
N  -3.725789 0.333585 0.66705
C  4.989302 0.644403 -0.185288
C  -0.676433 -1.369258 -0.407882
C  -4.505864 0.186088 -0.45594
C  -2.451452 -0.227412 0.724153
C  5.573536 0.847797 -1.574828
C  6.031359 0.043975 0.755452
C  1.705052 -1.008814 -0.576947
C  0.397952 -0.526133 -0.588292
C  -2.739746 -1.012965 -1.610299
C  -4.073357 -0.448846 -1.553729
C  4.521474 1.970864 0.420288
C  -0.471438 -2.726028 -0.23368
C  2.762014 0.031994 -0.738288
C  1.901291 -2.381367 -0.41395
C  -4.180852 0.996078 1.889133
C  0.814185 -3.229635 -0.248435
C  -5.901413 0.77751 -0.456281
C  3.046069 2.916504 1.992584
C  1.806364 2.527046 2.724452
C  1.228065 1.335005 2.733635
H  6.464149 1.47042 -1.515204
H  5.863989 -0.116366 -1.992671
H  4.8758 1.330518 -2.254239
H  6.875613 0.724565 0.858122
H  5.617347 -0.146947 1.744771
H  6.402461 -0.89781 0.3511
H  0.237098 0.533398 -0.733107
H  -4.686684 -0.560216 -2.432474
H  -1.311122 -3.393866 -0.097476
H  -4.710969 1.914048 1.660294
H  -4.815839 0.341765 2.483774
H  -3.309407 1.25223 2.479077
H  0.981289 -4.291126 -0.13513
H  2.814939 3.685909 1.24945
H  3.774255 3.35705 2.681951
H  1.355655 3.343623 3.279803
H  0.310162 1.168461 3.278072
H  1.625546 0.483253 2.200073
totalener: -2093.78485629 hartree
nucrepener: 3570.25672524 hartree
electener: -5664.04158153 hartree
oneelecener: -9977.43574850 hartree
twoeener: 4313.39416697 hartree
kineticenergy: 2086.89298747 hartree
xcener: -168.851817186286 hartree
chargesum: 0.0000000
charge: -0.045928 -0.157427 -0.151255 -0.157851 -0.272841 -0.262940 -0.384548 -0.338257 -0.344084 -0.363842 -0.121804 -0.129421 0.295965 0.188221 -0.023366 0.363046 -0.299112 -0.292856 -0.005355 -0.142441 0.276559 -0.156499 0.287675 -0.146351 0.397260 0.051300 -0.202822 -0.109715 0.538095 0.090428 -0.152016 -0.228897 0.103381 0.100349 0.121516 0.103590 0.114305 0.098881 0.116478 0.134886 0.114553 0.123649 0.125365 0.122994 0.115163 0.096106 0.095267 0.100543 0.110060 0.103992
qa: -0.0459 -0.1574 -0.1513 -0.1579 -0.2728 -0.2629 -0.3845 -0.3383 -0.3441 -0.3638 -0.1218 -0.1294 0.2960 0.1882 -0.0234 0.3630 -0.2991 -0.2929 -0.0054 -0.1424 0.2766 -0.1565 0.2877 -0.1464 0.3973 0.0513 -0.2028 -0.1097 0.5381 0.0904 -0.1520 -0.2289 0.1034 0.1003 0.1215 0.1036 0.1143 0.0989 0.1165 0.1349 0.1146 0.1236 0.1254 0.1230 0.1152 0.0961 0.0953 0.1005 0.1101 0.1040
va: 1.2695 1.1499 1.1610 1.1517 2.1499 2.1427 2.1209 2.1710 2.1738 2.1298 3.0888 3.3086 3.8725 3.6127 3.9651 4.2474 3.9388 3.9234 3.7057 4.1397 4.2806 3.8337 4.2314 4.1848 4.1498 4.0073 3.8662 4.0379 4.4143 3.8686 3.8548 3.9722 1.0137 1.0057 1.0169 1.0088 1.0135 1.0074 1.0452 1.0244 1.0141 1.0050 0.9909 1.0187 1.0201 1.0028 0.9963 1.0086 1.0128 1.0169
dispcorr: -0.029576232 hartree
energy: -2093.814432518359
dipole: 39.67347 -40.80196 -1.12849 11.09299 -11.39448 -0.30149 14.53800 -13.27779 1.26022
magnitude: 1.71829 au
magnitude: 4.36756 debye
