program: Orca
programVersion: 5.0.2
elementType: Cl Cl O O O O O N C C C C C C C C C C C C C C H H H H H H H H H
charge: 0
multiplicity: 1
keywords: wb97x-d3
keywords: def2-TZVPP
keywords: def2/J RIJCOSX
keywords: DEFGRID2
keywords: scfconv7
keywords: smallprint printgap noloewdin
keywords: NOSOSCF
formula: C14H9Cl2NO5
InChI: InChI=1/C14H9Cl2NO5/c1-21-14(18)10-7-9(3-4-12(10)17(19)20)22-13-5-2-8(15)6-11(13)16/h2-7H,1H3
31 atoms
Cl -2.722816 -0.767492 -2.474889
Cl -5.927266 2.22373 0.631888
O  -0.977614 -0.794799 -0.159828
O  4.192719 -2.176437 -0.659992
O  3.795921 -2.469185 1.525818
O  5.078348 0.17295 0.71398
O  4.439987 2.197106 0.501747
N  4.221243 1.008989 0.519505
C  2.586283 -0.813261 0.316943
C  0.26317 -0.284555 0.005567
C  2.86806 0.551262 0.315736
C  1.276792 -1.224071 0.172768
C  0.552418 1.075061 -0.02094
C  1.859265 1.487274 0.143618
C  -2.091402 -0.027154 0.035306
C  3.615773 -1.888853 0.4866
C  -3.032032 0.034354 -0.984062
C  -2.335314 0.617356 1.237335
C  -4.221948 0.721426 -0.804652
C  -3.511296 1.322558 1.42353
C  -4.446274 1.363549 0.400926
C  5.186806 -3.208163 -0.653513
H  1.029979 -2.278226 0.179716
H  -0.219562 1.817062 -0.170167
H  2.080988 2.544404 0.132915
H  -1.609592 0.563926 2.038836
H  -4.953994 0.756716 -1.599345
H  -3.694867 1.823374 2.363494
H  6.029544 -2.93551 -0.017956
H  5.52331 -3.300225 -1.681612
H  4.768481 -4.15864 -0.323372
elementType: Cl O N C H
totalener: -1890.20321349 hartree
nucrepener: 1955.44181828 hartree
electener: -3845.64503177 hartree
oneelecener: -6480.06173551 hartree
twoeener: 2634.41670374 hartree
cpcmener: -0.03473197 hartree
kineticenergy: 1885.12751986 hartree
xcener: -131.911558791889 hartree
chargesum: -0.0000000
charge: -0.062469 -0.083186 -0.304136 -0.264894 -0.453221 -0.399678 -0.397838 0.576453 0.037738 0.293470 -0.028251 -0.199636 -0.152756 -0.085844 0.268097 0.476642 -0.052741 -0.193024 -0.087896 -0.113346 0.058814 -0.128443 0.142769 0.163383 0.163478 0.169253 0.129085 0.151357 0.123331 0.131975 0.121514
qa: -0.0625 -0.0832 -0.3041 -0.2649 -0.4532 -0.3997 -0.3978 0.5765 0.0377 0.2935 -0.0283 -0.1996 -0.1528 -0.0858 0.2681 0.4766 -0.0527 -0.1930 -0.0879 -0.1133 0.0588 -0.1284 0.1428 0.1634 0.1635 0.1693 0.1291 0.1514 0.1233 0.1320 0.1215
va: 1.2519 1.2177 2.1221 2.1229 2.0476 1.8465 1.8661 4.0953 3.8785 3.8011 3.9160 4.1119 3.9507 4.0344 3.7320 4.1924 4.0063 3.9995 3.9853 3.9610 3.8788 3.8504 1.0163 0.9959 1.0153 0.9894 1.0172 1.0005 0.9921 0.9944 0.9933
dispcorr: -0.014815197 hartree
energy: -1890.218028688678
dipole: 20.12907 -21.98413 -1.85505 -6.98114 7.02343 0.04229 3.39541 -4.06885 -0.67344
magnitude: 1.97396 au
magnitude: 5.01742 debye
