program: Orca
programVersion: 5.0.2
elementType: Cl Cl O O O O O N C C C C C C C C C C C C C C H H H H H H H H H
charge: 0
multiplicity: 1
keywords: wb97x-d3
keywords: def2-TZVPP
keywords: def2/J RIJCOSX
keywords: DEFGRID2
keywords: scfconv7
keywords: smallprint printgap noloewdin
keywords: NOSOSCF
formula: C14H9Cl2NO5
InChI: InChI=1/C14H9Cl2NO5/c1-21-14(18)10-7-9(3-4-12(10)17(19)20)22-13-5-2-8(15)6-11(13)16/h2-7H,1H3
31 atoms
Cl -2.449479 1.753786 2.283964
Cl -5.504393 -1.50269 -0.705569
O  -0.739993 1.832794 -0.065874
O  3.104891 -2.044288 1.182913
O  2.074695 -2.687995 -0.701486
O  4.745078 -0.991993 -0.816959
O  5.387562 1.019127 -0.498795
N  4.52538 0.176127 -0.577314
C  2.171808 -0.37921 -0.143952
C  0.523049 1.362465 -0.178155
C  3.151582 0.578021 -0.390491
C  0.850109 0.016482 -0.042843
C  1.50997 2.314753 -0.407807
C  2.825552 1.920929 -0.514644
C  -1.813561 0.999873 -0.221215
C  2.462505 -1.834539 0.054274
C  -2.732412 0.903283 0.81562
C  -2.032814 0.313401 -1.404683
C  -3.879895 0.13963 0.67063
C  -3.16504 -0.467285 -1.556646
C  -4.079614 -0.543351 -0.517151
C  3.488564 -3.390472 1.486786
H  0.089001 -0.723745 0.167737
H  1.243302 3.357348 -0.514883
H  3.585551 2.660487 -0.720906
H  -1.321071 0.392796 -2.21699
H  -4.596801 0.077099 1.477956
H  -3.33085 -1.001446 -2.481701
H  4.036192 -3.336623 2.422716
H  4.135856 -3.798191 0.710789
H  2.616167 -4.030504 1.613096
elementType: Cl O N C H
totalener: -1890.20334193 hartree
nucrepener: 1987.69891328 hartree
electener: -3877.90225521 hartree
oneelecener: -6544.73288064 hartree
twoeener: 2666.83062543 hartree
cpcmener: -0.03326888 hartree
kineticenergy: 1885.12483399 hartree
xcener: -131.909958373927 hartree
chargesum: -0.0000000
charge: -0.062108 -0.082908 -0.305171 -0.265595 -0.451672 -0.391560 -0.394222 0.561836 0.018253 0.282545 -0.016489 -0.125692 -0.209816 -0.065853 0.248541 0.458877 -0.040650 -0.176346 -0.095482 -0.117996 0.063527 -0.127341 0.151032 0.155740 0.161606 0.167898 0.130011 0.151453 0.131996 0.122192 0.123393
qa: -0.0621 -0.0829 -0.3052 -0.2656 -0.4517 -0.3916 -0.3942 0.5618 0.0183 0.2825 -0.0165 -0.1257 -0.2098 -0.0659 0.2485 0.4589 -0.0406 -0.1763 -0.0955 -0.1180 0.0635 -0.1273 0.1510 0.1557 0.1616 0.1679 0.1300 0.1515 0.1320 0.1222 0.1234
va: 1.2522 1.2180 2.1241 2.1255 2.0505 1.8544 1.8644 4.0809 3.8875 3.7899 3.8668 3.9582 4.0496 4.0204 3.7542 4.1973 4.0014 3.9950 3.9939 3.9649 3.8755 3.8489 1.0079 1.0042 1.0106 0.9902 1.0172 1.0006 0.9944 0.9929 0.9926
dispcorr: -0.015155918 hartree
energy: -1890.218497851275
dipole: 16.76273 -18.16817 -1.40544 -6.08152 6.79861 0.71709 -1.80283 2.23602 0.43319
magnitude: 1.63619 au
magnitude: 4.15888 debye
