program: Orca
programVersion: 5.0.2
elementType: Cl Cl O O O O O N C C C C C C C C C C C C C C H H H H H H H H H
charge: 0
multiplicity: 1
keywords: wb97x-d3
keywords: def2-TZVPP
keywords: def2/J RIJCOSX
keywords: DEFGRID2
keywords: scfconv7
keywords: smallprint printgap noloewdin
keywords: NOSOSCF
formula: C14H9Cl2NO5
InChI: InChI=1/C14H9Cl2NO5/c1-21-14(18)10-7-9(3-4-12(10)17(19)20)22-13-5-2-8(15)6-11(13)16/h2-7H,1H3
31 atoms
Cl -1.675507 0.1778 2.301201
Cl -5.975128 2.299862 -0.120726
O  -1.225503 -1.115523 -0.309044
O  4.085756 -2.345848 -0.985976
O  3.583474 -2.597219 1.182318
O  4.18568 1.937544 -0.741975
O  4.825208 0.111932 0.159857
N  3.969526 0.827436 -0.315861
C  2.36863 -1.029775 -0.125273
C  0.018877 -0.581631 -0.337867
C  2.618982 0.321087 -0.363087
C  1.062281 -1.474006 -0.107469
C  0.274328 0.760262 -0.591116
C  1.580459 1.207567 -0.598815
C  -2.31472 -0.28379 -0.273356
C  3.43225 -2.05548 0.117443
C  -2.656923 0.37481 0.901941
C  -3.103356 -0.142172 -1.400076
C  -3.784132 1.176796 0.955721
C  -4.239787 0.649206 -1.359493
C  -4.56401 1.30445 -0.182601
C  5.137969 -3.31276 -0.887415
H  0.841528 -2.517924 0.07628
H  -0.522959 1.46648 -0.77815
H  1.774814 2.255657 -0.774279
H  -2.832984 -0.659706 -2.311008
H  -4.045229 1.688441 1.8718
H  -4.856754 0.753387 -2.240718
H  4.743968 -4.295314 -0.629886
H  5.883534 -3.011051 -0.152559
H  5.595779 -3.353361 -1.870814
elementType: Cl O N C H
totalener: -1890.20370318 hartree
nucrepener: 1983.73354880 hartree
electener: -3873.93725197 hartree
oneelecener: -6536.95227101 hartree
twoeener: 2663.01501904 hartree
cpcmener: -0.03397950 hartree
kineticenergy: 1885.13457786 hartree
xcener: -131.912246741307 hartree
chargesum: 0.0000000
charge: -0.057617 -0.081125 -0.301084 -0.265683 -0.453213 -0.395135 -0.394343 0.566214 0.031361 0.213678 -0.009836 -0.160679 -0.117605 -0.097837 0.230394 0.465941 0.006813 -0.182292 -0.110916 -0.118531 0.074062 -0.127310 0.142650 0.162307 0.161649 0.157361 0.133293 0.150696 0.124409 0.120523 0.131855
qa: -0.0576 -0.0811 -0.3011 -0.2657 -0.4532 -0.3951 -0.3943 0.5662 0.0314 0.2137 -0.0098 -0.1607 -0.1176 -0.0978 0.2304 0.4659 0.0068 -0.1823 -0.1109 -0.1185 0.0741 -0.1273 0.1426 0.1623 0.1616 0.1574 0.1333 0.1507 0.1244 0.1205 0.1319
va: 1.2567 1.2194 2.1178 2.1250 2.0484 1.8654 1.8524 4.0873 3.8903 3.8231 3.8691 4.0867 3.9136 4.0603 3.7447 4.1893 3.9949 4.0093 4.0247 3.9609 3.8725 3.8500 1.0180 0.9968 1.0145 0.9992 1.0160 1.0004 0.9923 0.9936 0.9947
dispcorr: -0.015401668 hartree
energy: -1890.219104844120
dipole: 16.89566 -19.12820 -2.23254 -10.41705 10.09157 -0.32549 -9.39248 7.53669 -1.85579
magnitude: 2.92132 au
magnitude: 7.42541 debye
