program: Orca
programVersion: 5.0.2
elementType: Cl Cl O O O O O N C C C C C C C C C C C C C C H H H H H H H H H
charge: 0
multiplicity: 1
keywords: wb97x-d3
keywords: def2-TZVPP
keywords: def2/J RIJCOSX
keywords: DEFGRID2
keywords: scfconv7
keywords: smallprint printgap noloewdin
keywords: NOSOSCF
formula: C14H9Cl2NO5
InChI: InChI=1/C14H9Cl2NO5/c1-21-14(18)10-7-9(3-4-12(10)17(19)20)22-13-5-2-8(15)6-11(13)16/h2-7H,1H3
31 atoms
Cl -1.431402 1.292425 2.280452
Cl -5.584061 -1.426049 0.223427
O  -0.915742 2.017871 -0.533169
O  2.749542 -2.122794 -1.325086
O  1.92706 -2.350464 0.746218
O  4.593659 -0.745934 0.285856
O  5.218787 1.199931 -0.330098
N  4.363129 0.380276 -0.096377
C  1.979938 -0.200891 -0.265759
C  0.347377 1.548917 -0.437361
C  2.980181 0.765969 -0.25867
C  0.656443 0.19599 -0.34989
C  1.353901 2.509138 -0.444544
C  2.669887 2.116148 -0.353231
C  -1.979233 1.17831 -0.354176
C  2.238351 -1.675724 -0.198277
C  -2.353414 0.774653 0.922693
C  -2.722387 0.776949 -1.449721
C  -3.464622 -0.030303 1.108301
C  -3.841083 -0.021291 -1.279339
C  -4.19643 -0.421772 -0.00138
C  3.071113 -3.515375 -1.391213
H  -0.121853 -0.55692 -0.36606
H  1.10073 3.558977 -0.508287
H  3.447715 2.866207 -0.337029
H  -2.428802 1.098614 -2.440748
H  -3.751247 -0.341677 2.103432
H  -4.421392 -0.327654 -2.138481
H  3.493149 -3.674791 -2.379383
H  2.181929 -4.134755 -1.273055
H  3.808219 -3.786418 -0.635298
elementType: Cl O N C H
totalener: -1890.21141186 hartree
nucrepener: 2015.39838389 hartree
electener: -3905.60979575 hartree
oneelecener: -6600.41546481 hartree
twoeener: 2694.80566906 hartree
cpcmener: -0.02810252 hartree
kineticenergy: 1885.14465553 hartree
xcener: -131.912525076381 hartree
chargesum: 0.0000000
charge: -0.055066 -0.078493 -0.295009 -0.262876 -0.423972 -0.381946 -0.384746 0.553052 0.019668 0.236433 -0.021739 -0.116150 -0.189891 -0.071148 0.218590 0.438664 0.012319 -0.172184 -0.110996 -0.124420 0.077276 -0.127280 0.144638 0.151626 0.159158 0.153921 0.130769 0.148017 0.130013 0.119978 0.121795
qa: -0.0551 -0.0785 -0.2950 -0.2629 -0.4240 -0.3819 -0.3847 0.5531 0.0197 0.2364 -0.0217 -0.1161 -0.1899 -0.0711 0.2186 0.4387 0.0123 -0.1722 -0.1110 -0.1244 0.0773 -0.1273 0.1446 0.1516 0.1592 0.1539 0.1308 0.1480 0.1300 0.1200 0.1218
va: 1.2598 1.2223 2.1331 2.1238 2.0850 1.8655 1.8772 4.1043 3.9067 3.7840 3.8762 3.9329 4.0509 4.0327 3.7676 4.2325 3.9886 4.0101 4.0276 3.9714 3.8811 3.8544 1.0120 1.0067 1.0131 1.0000 1.0170 1.0017 0.9947 0.9934 0.9929
dispcorr: -0.015619093 hartree
energy: -1890.227030950162
dipole: 12.85182 -14.72390 -1.87208 -5.01151 5.59767 0.58616 -10.92506 9.11310 -1.81196
magnitude: 2.67048 au
magnitude: 6.78783 debye
