program: Orca
programVersion: 5.0.2
elementType: Cl Cl O O O O O N C C C C C C C C C C C C C C H H H H H H H H H
charge: 0
multiplicity: 1
keywords: wb97x-d3
keywords: def2-TZVPP
keywords: def2/J RIJCOSX
keywords: DEFGRID2
keywords: scfconv7
keywords: smallprint printgap noloewdin
keywords: NOSOSCF
formula: C14H9Cl2NO5
InChI: InChI=1/C14H9Cl2NO5/c1-21-14(18)10-7-9(3-4-12(10)17(19)20)22-13-5-2-8(15)6-11(13)16/h2-7H,1H3
31 atoms
Cl -2.023349 -1.44522 1.446101
Cl -5.990269 2.12706 0.882012
O  -1.200166 -0.489917 -1.222075
O  4.035148 -2.246144 -0.06705
O  3.543867 -2.194797 -2.254886
O  4.851571 0.361501 -0.401608
O  4.16241 1.356279 1.367606
N  3.987471 0.70343 0.368953
C  2.360368 -0.787954 -0.747795
C  0.033848 -0.178285 -0.75803
C  2.621044 0.332978 0.037032
C  1.061776 -1.028694 -1.152209
C  0.298371 0.921076 0.046977
C  1.600546 1.173049 0.440117
C  -2.2914 0.144998 -0.70955
C  3.395343 -1.798283 -1.135881
C  -2.804919 -0.22116 0.530659
C  -2.923786 1.129755 -1.449257
C  -3.946072 0.389286 1.024042
C  -4.067606 1.744512 -0.96789
C  -4.568456 1.370635 0.269171
C  5.117052 -3.142017 -0.294632
H  0.835459 -1.890509 -1.765893
H  -0.48967 1.59243 0.359321
H  1.819727 2.039449 1.047254
H  -2.519624 1.405281 -2.414464
H  -4.342922 0.097756 1.985939
H  -4.562039 2.509023 -1.549822
H  5.522516 -3.372747 0.686122
H  5.889021 -2.677262 -0.907447
H  4.783015 -4.059707 -0.77808
totalener: -1890.19327903 hartree
nucrepener: 1984.44986739 hartree
electener: -3874.64314643 hartree
oneelecener: -6538.24597856 hartree
twoeener: 2663.60283213 hartree
kineticenergy: 1885.19316333 hartree
xcener: -131.915270938938 hartree
chargesum: 0.0000000
charge: -0.034211 -0.056043 -0.281111 -0.261355 -0.335629 -0.326162 -0.333818 0.499929 0.043734 0.187358 -0.018438 -0.147818 -0.092767 -0.110857 0.192218 0.370209 0.002091 -0.159004 -0.112493 -0.108458 0.065740 -0.130451 0.130443 0.132497 0.146584 0.136658 0.120766 0.128959 0.119515 0.119917 0.111998
qa: -0.0342 -0.0560 -0.2811 -0.2614 -0.3356 -0.3262 -0.3338 0.4999 0.0437 0.1874 -0.0184 -0.1478 -0.0928 -0.1109 0.1922 0.3702 0.0021 -0.1590 -0.1125 -0.1085 0.0657 -0.1305 0.1304 0.1325 0.1466 0.1367 0.1208 0.1290 0.1195 0.1199 0.1120
va: 1.2808 1.2458 2.1384 2.1192 2.1711 1.9114 1.9088 4.1253 3.8852 3.8992 3.9162 4.0816 3.9061 4.0965 3.8218 4.2460 4.0223 4.0154 4.0206 3.9867 3.9538 3.8833 1.0256 1.0085 1.0203 1.0075 1.0214 1.0093 0.9951 0.9953 0.9945
dispcorr: -0.015447074 hartree
energy: -1890.208726105917
dipole: 17.92874 -19.40537 -1.47663 -4.68448 4.72096 0.03647 -6.02948 6.17590 0.14641
magnitude: 1.48432 au
magnitude: 3.77285 debye
