program: Orca
programVersion: 5.0.2
elementType: Cl Cl O O N N N C C C C C C C C C C C C C C C H H H H H H H H H H H H H
charge: 0
multiplicity: 1
keywords: wb97x-d3
keywords: def2-TZVPP
keywords: def2/J RIJCOSX
keywords: DEFGRID2
keywords: scfconv7
keywords: smallprint printgap noloewdin
keywords: NOSOSCF
formula: C15H13Cl2N3O2
InChI: InChI=1/C15H13Cl2N3O2/c1-2-7-22-13-9-12(10(16)8-11(13)17)20-15(21)19-6-4-3-5-14(19)18-20/h1,8-9H,3-7H2
35 atoms
Cl 0.066024 2.605193 -1.548268
Cl -4.734139 0.941408 0.14986
O  1.598724 -0.21182 -2.094241
O  -3.1716 -1.052152 1.681385
N  3.157174 -0.126477 -0.362626
N  1.128116 0.343007 0.123864
N  1.82177 0.381875 1.304593
C  5.574639 -0.316248 -0.185243
C  5.338503 -0.756974 1.254545
C  4.353811 -0.581115 -1.050171
C  4.21365 0.06232 1.882244
C  3.036276 0.105444 0.977032
C  1.915649 -0.016924 -0.935183
C  -0.264038 0.487693 0.107398
C  -1.047057 -0.363619 0.874412
C  -0.877754 1.478154 -0.653178
C  -2.425448 -0.238487 0.894489
C  -2.257544 1.604469 -0.659243
C  -3.022498 0.749333 0.112961
C  -3.742622 -2.187655 1.034476
C  -2.732335 -3.159756 0.634482
C  -1.889906 -3.949452 0.303773
H  5.822974 0.748553 -0.20805
H  6.420898 -0.849327 -0.619752
H  6.247384 -0.62942 1.842735
H  5.089865 -1.821605 1.282746
H  4.427499 -0.062893 -2.005802
H  4.256782 -1.649223 -1.257033
H  4.560263 1.085914 2.05244
H  3.91232 -0.333178 2.8525
H  -0.572889 -1.128387 1.476176
H  -2.731986 2.378298 -1.24696
H  -4.427119 -2.631583 1.758283
H  -4.33608 -1.896051 0.162484
H  -1.144441 -4.655394 0.01206
elementType: Cl O N C H
totalener: -1814.58208674 hartree
nucrepener: 2044.67439172 hartree
electener: -3859.25647846 hartree
oneelecener: -6552.86091824 hartree
twoeener: 2693.60443978 hartree
cpcmener: -0.03373250 hartree
kineticenergy: 1809.51377587 hartree
xcener: -127.983372946985 hartree
chargesum: -0.0000000
charge: -0.058454 -0.066133 -0.524938 -0.342678 -0.117942 0.024716 -0.324959 -0.130746 -0.134056 -0.065089 -0.094333 0.152354 0.386333 0.162672 -0.202477 -0.060405 0.243585 -0.076449 0.004574 0.029219 -0.416318 0.037714 0.083340 0.083164 0.084962 0.082528 0.105703 0.115397 0.098174 0.096842 0.147255 0.128132 0.131745 0.135541 0.281026
qa: -0.0585 -0.0661 -0.5249 -0.3427 -0.1179 0.0247 -0.3250 -0.1307 -0.1341 -0.0651 -0.0943 0.1524 0.3863 0.1627 -0.2025 -0.0604 0.2436 -0.0764 0.0046 0.0292 -0.4163 0.0377 0.0833 0.0832 0.0850 0.0825 0.1057 0.1154 0.0982 0.0968 0.1473 0.1281 0.1317 0.1355 0.2810
va: 1.2584 1.2467 2.0022 2.0223 3.2787 3.1434 2.9308 3.9445 3.9050 3.8737 3.9281 4.0901 4.3079 3.6653 4.0794 4.0600 3.8877 4.0048 3.9703 3.9107 3.6737 3.6409 1.0095 1.0134 1.0108 1.0101 1.0045 0.9950 1.0077 1.0185 1.0175 1.0192 0.9867 0.9912 0.9490
dispcorr: -0.017475549 hartree
energy: -1814.599562288289
dipole: 32.19093 -30.06258 2.12835 -16.00108 14.97611 -1.02497 7.03436 -6.06613 0.96823
magnitude: 2.55301 au
magnitude: 6.48925 debye
