program: Orca
programVersion: 5.0.2
elementType: Cl Cl O O N N N C C C C C C C C C C C C C C C H H H H H H H H H H H H H
charge: 0
multiplicity: 1
keywords: wb97x-d3
keywords: def2-TZVPP
keywords: def2/J RIJCOSX
keywords: DEFGRID2
keywords: scfconv7
keywords: smallprint printgap noloewdin
keywords: NOSOSCF
formula: C15H13Cl2N3O2
InChI: InChI=1/C15H13Cl2N3O2/c1-2-7-22-13-9-12(10(16)8-11(13)17)20-15(21)19-6-4-3-5-14(19)18-20/h1,8-9H,3-7H2
35 atoms
Cl 0.244264 2.809651 -1.197475
Cl -4.73949 1.136771 -0.188084
O  1.206467 -1.881351 -1.092426
O  -3.485484 -1.237296 0.791182
N  3.006059 -0.708969 -0.194692
N  1.063728 0.164611 0.042988
N  1.944323 1.027303 0.634273
C  5.367599 -1.159956 0.130475
C  5.549297 0.353867 0.188502
C  4.1073 -1.536246 -0.634349
C  4.401334 0.994426 0.966393
C  3.094575 0.481274 0.474179
C  1.680457 -0.940319 -0.500541
C  -0.30905 0.433113 -0.004774
C  -1.192057 -0.53469 0.45808
C  -0.803404 1.618562 -0.532847
C  -2.56384 -0.346459 0.389083
C  -2.172066 1.835856 -0.565294
C  -3.043576 0.864383 -0.11561
C  -3.067269 -2.502611 1.2513
C  -2.394785 -3.294883 0.228186
C  -1.795998 -3.901142 -0.614384
H  6.222291 -1.634609 -0.352855
H  5.319061 -1.560695 1.147237
H  5.589437 0.761186 -0.825799
H  6.498282 0.604888 0.663124
H  4.257554 -1.394467 -1.707936
H  3.84293 -2.582849 -0.483052
H  4.413879 2.081647 0.893217
H  4.50207 0.750891 2.028352
H  -0.77328 -1.450794 0.84695
H  -2.562139 2.759919 -0.96719
H  -2.417249 -2.405744 2.129796
H  -3.978605 -3.00176 1.581433
H  -1.252705 -4.419711 -1.367095
totalener: -1814.55450518 hartree
nucrepener: 2051.43430651 hartree
electener: -3865.98881169 hartree
oneelecener: -6565.98274866 hartree
twoeener: 2699.99393698 hartree
kineticenergy: 1809.57404646 hartree
xcener: -127.996356725166 hartree
chargesum: -0.0000000
charge: -0.057049 -0.058419 -0.415158 -0.274202 -0.140788 -0.001268 -0.266713 -0.138978 -0.140892 -0.066044 -0.110688 0.132979 0.334715 0.124201 -0.152851 -0.067458 0.327542 -0.074419 -0.045269 0.001584 -0.410606 0.093992 0.080322 0.078635 0.080995 0.083888 0.103357 0.101696 0.098914 0.086962 0.102790 0.104607 0.123931 0.119911 0.239779
qa: -0.0570 -0.0584 -0.4152 -0.2742 -0.1408 -0.0013 -0.2667 -0.1390 -0.1409 -0.0660 -0.1107 0.1330 0.3347 0.1242 -0.1529 -0.0675 0.3275 -0.0744 -0.0453 0.0016 -0.4106 0.0940 0.0803 0.0786 0.0810 0.0839 0.1034 0.1017 0.0989 0.0870 0.1028 0.1046 0.1239 0.1199 0.2398
va: 1.2559 1.2529 2.1147 2.1369 3.2481 3.1689 2.9096 3.9233 3.8860 3.8825 3.9210 4.0621 4.3221 3.7966 3.9762 4.0832 3.8613 4.0307 3.9730 3.9873 3.6797 3.7440 1.0157 1.0108 1.0114 1.0128 0.9975 1.0097 1.0202 1.0091 1.0279 1.0296 0.9826 0.9866 0.9767
dispcorr: -0.017568964 hartree
energy: -1814.572074145603
dipole: 33.84132 -31.70112 2.14020 -15.93818 15.32611 -0.61207 6.07404 -5.33273 0.74131
magnitude: 2.34619 au
magnitude: 5.96355 debye
