program: Orca
programVersion: 5.0.2
elementType: Cl F F F O O O O O N C C C C C C C C C C C C C C H H H H H H H
charge: 0
multiplicity: 1
keywords: wb97x-d3
keywords: def2-TZVPP
keywords: def2/J RIJCOSX
keywords: DEFGRID2
keywords: scfconv7
keywords: smallprint printgap noloewdin
keywords: NOSOSCF
formula: C14H7ClF3NO5
InChI: InChI=1/C14H7ClF3NO5/c15-10-5-7(14(16,17)18)1-4-12(10)24-8-2-3-11(19(22)23)9(6-8)13(20)21/h1-6,20H
31 atoms
Cl -1.666967 -0.371686 -3.032878
F  -5.630204 0.065323 1.717485
F  -6.011255 -0.88755 -0.175055
F  -5.083269 -1.990742 1.417162
O  -0.016419 0.75929 -0.94663
O  5.305209 1.435008 -1.313555
O  4.749231 2.753461 0.410394
O  5.763154 -0.006848 1.156866
O  4.868958 -1.770169 1.957041
N  4.817552 -0.745701 1.32079
C  -1.23022 0.359851 -0.481135
C  1.127506 0.349604 -0.353255
C  -3.772497 -0.364142 0.345951
C  3.464144 0.8061 -0.023072
C  2.238795 1.161236 -0.554548
C  3.557396 -0.366008 0.723102
C  -2.13629 -0.170655 -1.390058
C  -1.599512 0.529223 0.84474
C  -3.411268 -0.527255 -0.982629
C  -2.865048 0.161309 1.259182
C  1.229532 -0.82559 0.382304
C  2.44985 -1.176401 0.921945
C  -5.126774 -0.791013 0.820901
C  4.599247 1.761508 -0.250033
H  2.135734 2.071307 -1.132686
H  -0.900698 0.956246 1.552677
H  -4.100595 -0.933214 -1.710405
H  -3.133202 0.30058 2.297762
H  0.379005 -1.475876 0.534973
H  2.527452 -2.088689 1.495411
H  6.010549 2.08601 -1.464407
elementType: Cl F O N C H
totalener: -1728.41239213 hartree
nucrepener: 2136.18658170 hartree
electener: -3864.59897383 hartree
oneelecener: -6620.91283834 hartree
twoeener: 2756.31386450 hartree
cpcmener: -0.03424523 hartree
kineticenergy: 1723.18263634 hartree
xcener: -132.994071424602 hartree
chargesum: -0.0000000
charge: -0.057999 -0.180906 -0.178898 -0.179820 -0.299200 -0.275369 -0.409925 -0.386550 -0.384079 0.563166 0.231019 0.283356 -0.049136 0.015933 -0.186483 -0.015686 -0.011405 -0.157725 -0.112405 -0.142996 -0.147841 -0.087470 0.557645 0.425444 0.141648 0.168706 0.132601 0.153450 0.162804 0.162646 0.265474
qa: -0.0580 -0.1809 -0.1789 -0.1798 -0.2992 -0.2754 -0.4099 -0.3865 -0.3841 0.5632 0.2310 0.2834 -0.0491 0.0159 -0.1865 -0.0157 -0.0114 -0.1577 -0.1124 -0.1430 -0.1478 -0.0875 0.5576 0.4254 0.1416 0.1687 0.1326 0.1535 0.1628 0.1626 0.2655
va: 1.2571 1.1198 1.1249 1.1102 2.1279 2.2106 2.0889 1.8621 1.8834 4.1189 3.8077 3.8016 3.7061 3.8789 4.1200 3.9152 3.9920 3.9619 4.0298 4.0122 3.9500 4.0382 4.4165 4.3414 1.0150 0.9897 1.0271 1.0065 0.9957 1.0159 0.9868
dispcorr: -0.014749888 hartree
energy: -1728.427142022273
dipole: 20.75764 -22.05998 -1.30234 4.10897 -4.10476 0.00421 2.80138 -3.61243 -0.81104
magnitude: 1.53424 au
magnitude: 3.89974 debye
