program: Orca
programVersion: 5.0.2
elementType: Cl F F F O O O O O N C C C C C C C C C C C C C C H H H H H H H
charge: 0
multiplicity: 1
keywords: wb97x-d3
keywords: def2-TZVPP
keywords: def2/J RIJCOSX
keywords: DEFGRID2
keywords: scfconv7
keywords: smallprint printgap noloewdin
keywords: NOSOSCF
formula: C14H7ClF3NO5
InChI: InChI=1/C14H7ClF3NO5/c15-10-5-7(14(16,17)18)1-4-12(10)24-8-2-3-11(19(22)23)9(6-8)13(20)21/h1-6,20H
31 atoms
Cl -1.573891 -2.623687 1.800118
F  -5.385072 0.872825 -1.437347
F  -5.644759 0.416936 0.652875
F  -4.627892 2.218928 0.054665
O  0.128791 -1.798679 -0.391557
O  3.393987 2.876956 -0.111413
O  2.487566 2.327394 1.862383
O  5.449399 1.190561 0.688759
O  6.016814 0.039569 -1.02878
N  5.213205 0.435459 -0.222188
C  -1.027787 -1.088873 -0.336475
C  1.329576 -1.174139 -0.370377
C  -3.479648 0.202322 -0.254809
C  2.789516 0.644071 0.212475
C  1.524866 0.076597 0.202845
C  3.852315 -0.069862 -0.326977
C  -1.954871 -1.414852 0.643844
C  -1.325758 -0.105358 -1.270573
C  -3.185985 -0.776335 0.679227
C  -2.545015 0.540211 -1.227998
C  2.395595 -1.869478 -0.926399
C  3.659169 -1.317097 -0.897771
C  -4.793829 0.925204 -0.239361
C  2.898255 2.026048 0.7806
H  0.700536 0.61963 0.646389
H  -0.604657 0.142016 -2.038922
H  -3.896126 -1.053096 1.445302
H  -2.76576 1.299705 -1.965768
H  2.231167 -2.844948 -1.363109
H  4.496808 -1.859799 -1.311137
H  3.478356 3.748206 0.299684
totalener: -1728.39118889 hartree
nucrepener: 2165.38430822 hartree
electener: -3893.77549711 hartree
oneelecener: -6679.65801042 hartree
twoeener: 2785.88251331 hartree
kineticenergy: 1723.24102734 hartree
xcener: -132.995106199994 hartree
chargesum: 0.0000000
charge: -0.030815 -0.169610 -0.169706 -0.166879 -0.281798 -0.252402 -0.313535 -0.322251 -0.331473 0.499554 0.177209 0.222189 -0.066044 -0.001548 -0.098629 -0.013039 0.007742 -0.135117 -0.112706 -0.133656 -0.179939 -0.069142 0.551789 0.346996 0.137482 0.143266 0.130895 0.129918 0.138623 0.148797 0.213827
qa: -0.0308 -0.1696 -0.1697 -0.1669 -0.2818 -0.2524 -0.3135 -0.3223 -0.3315 0.4996 0.1772 0.2222 -0.0660 -0.0015 -0.0986 -0.0130 0.0077 -0.1351 -0.1127 -0.1337 -0.1799 -0.0691 0.5518 0.3470 0.1375 0.1433 0.1309 0.1299 0.1386 0.1488 0.2138
va: 1.2860 1.1334 1.1391 1.1335 2.1392 2.2050 2.1812 1.9173 1.9142 4.1250 3.8689 3.8804 3.7966 3.9098 3.9375 3.9320 4.0269 3.9688 4.0024 4.0686 4.0503 4.0415 4.4300 4.3454 1.0154 0.9998 1.0290 1.0160 1.0110 1.0177 1.0340
dispcorr: -0.014996316 hartree
energy: -1728.406185205492
dipole: 20.28972 -20.98434 -0.69462 0.29860 -0.72788 -0.42928 -5.87991 4.83779 -1.04212
magnitude: 1.32393 au
magnitude: 3.36517 debye
