program: Gaussian 09
title: 000056351
version: EM64L-G09RevD.01
frameworkgroup: C1[X(C13H19NO2)]
method: RPBEPBE
basis: SDD
operation: Freq
keyword: #p
keyword: freq=noraman
keyword: PBEPBE/SDD
title: #p freq=noraman PBEPBE/SDD
converged: YES YES NO NO
title: Mulliken charges:
elementType: O O N C C C C C C C C C C C C C H H H H H H H H H H H H H H H H H H H
charge: -0.214455 -0.212529 -0.157876 0.314263 -0.488102 -0.473983 -0.641642 -0.386069 -0.378515 0.115578 -0.402987 -0.405931 0.163797 -0.442487 -0.019447 -0.554153 0.204671 0.216693 0.233671 0.210564 0.265756 0.262054 0.192127 0.237036 0.198794 0.196645 0.189497 0.203234 0.199870 0.200834 0.247050 0.236731 0.245610 0.218324 0.225377
chargesum: 0.00000
title: Mulliken charges with hydrogens summed into heavy atoms:
elementType: O O N C C C C C C C C C C C C C
charge: -0.214455 -0.212529 -0.157876 0.314263 -0.066738 -0.029748 -0.113831 0.043094 0.016923 0.115578 -0.010256 -0.005227 0.163797 0.041294 0.226163 -0.110452
polarizability: 1.68070406e+02 -2.27094602e-01 1.48925384e+02 -4.61187818e+00 1.48415362e+00 1.19432578e+02
1716.lowfreq: -27.1614 -6.6071 -0.0006 -0.0005 -0.0003 6.8901 22.0961 28.3527 51.4168
frequency: 20.7728 28.1948 50.0714 70.7543 90.4967 134.6195 152.6015 204.2278 221.4040 239.0169 253.0136 257.3987 322.7949 333.9541 345.0266 363.1341 387.0603 419.9944 449.3338 491.1845 554.0059 561.1969 595.6892 614.6522 643.0238 710.5526 725.7139 753.8057 797.9397 821.8816 831.2388 849.4319 879.8940 912.8032 927.7427 929.6364 947.9084 960.3824 962.3771 998.8225 1009.6539 1035.0315 1041.2745 1057.0474 1070.6030 1092.2246 1113.0720 1121.1490 1142.3790 1182.1473 1186.5638 1201.1648 1205.4017 1219.7676 1257.7530 1269.7181 1281.3758 1283.2783 1296.6626 1317.0631 1326.0391 1331.2393 1336.9794 1345.9909 1346.8475 1355.8998 1357.2504 1362.6313 1428.8758 1438.9820 1445.0313 1459.3332 1462.9401 1465.6827 1470.7894 1478.0768 1487.6644 1618.3117 1661.7804 1683.1124 2954.6259 2963.0809 2965.2090 2968.5146 2976.1372 2986.3090 3009.1934 3012.0445 3012.7575 3021.1106 3021.3522 3030.3743 3034.2770 3049.5450 3072.2870 3085.2692 3092.3722 3118.1766 3201.8640
redmass: 4.2114 4.1954 3.3538 3.2236 3.2786 3.6468 2.8197 2.4198 3.3945 3.5291 1.9706 3.6249 2.8804 4.3029 3.0578 2.1415 2.2579 2.5714 2.1703 1.5070 2.9497 3.0951 3.5486 2.8378 3.6848 5.1036 3.4483 2.8255 1.6256 2.6202 2.0128 1.6347 1.9036 2.0435 1.9892 2.1918 1.9350 1.8099 1.5778 1.9666 1.2082 1.8855 4.0799 2.2434 1.9886 1.9944 2.0488 2.2803 1.9160 1.5604 1.9169 1.2896 2.3006 1.3461 1.4419 1.3654 1.2279 1.2203 1.3815 2.0777 1.6874 1.3321 1.4328 1.4251 1.4100 1.4089 1.4138 1.8013 1.1677 1.0851 1.1167 1.0837 1.0846 1.0856 1.0830 1.0824 1.0795 11.9443 4.6459 11.4242 1.0613 1.0624 1.0608 1.0622 1.0635 1.0664 1.0641 1.0949 1.0609 1.0996 1.0984 1.1002 1.1006 1.0997 1.0994 1.0991 1.0621 1.0961 1.1148
irintensity: 0.0578 0.1064 0.7798 0.7965 2.6489 6.6566 0.8071 0.7856 1.4392 1.6710 0.4138 1.7411 9.8752 9.5252 1.3847 1.9087 1.6364 4.2346 4.1513 0.8623 0.8094 2.7762 8.9762 4.7452 6.4607 9.4345 32.5952 8.9658 0.3177 1.8448 4.9270 2.8380 16.1928 6.8529 8.2744 11.6564 10.1280 33.3322 66.2830 0.5948 18.6977 5.8301 17.6257 1.1244 3.8386 3.7919 37.3122 49.0373 14.2797 0.5059 15.5939 8.4201 41.5685 1.8322 7.2972 1.0400 6.5815 1.3206 13.4463 116.2081 74.5510 1.2403 0.1795 4.0789 1.1908 0.6279 2.9074 76.6151 9.6886 10.5184 36.1006 4.8983 6.7650 6.5435 9.7741 10.2426 22.7454 505.7659 6.3785 34.7490 33.5338 30.5775 17.4491 26.1735 27.0536 19.6645 14.1662 84.1278 11.5396 13.1979 78.0012 35.8410 37.4698 49.4743 6.4012 0.2282 7.3138 5.9754 20.2997
temp: 298.150 k
press: 1.00000 atm
elementType: 8 8 7 6 6 6 6 6 6 6 6 6 6 6 6 6 1 1 1 1 1 1 1 1 1 1 1 1 1 1 1 1 1 1 1
symmnumber: 1
zpe: 781371.1 jmol-1
zpe.correction: 0.297609 hartree
zpe.thermalcorrener: 0.313372 hartree
zpe.thermalcorrenthalpy: 0.314317 hartree
zpe.thermalcorrgfe: 0.253051 hartree
zpe.sumelectzpe: -710.757969 hartree
zpe.sumelectthermal: -710.742205 hartree
zpe.sumelectthermalent: -710.741261 hartree
zpe.sumelectthermalfe: -710.802526 hartree
dipole: 2.1901 0.0320 0.4691
dipole: 2.2400
quadrupole: -95.3715 -106.2243 -93.1253
quadrupole: 9.4549 0.2289 -3.2295
quadrupole: 2.8688 -7.9839 5.1151 9.4549 0.2289 -3.2295
hfenergy: -711.0555773 hartree
pointgroup: C01 [X(C13H19N1O2)]
dipole: 0.8601088 -0.0228813 -0.1906 debye
polarizability: 168.1400485|0.220086|148.9772224|4.2465968|0.7172116|119.3110963 unknown
InChI: InChI=1S/C13H19NO2/c1-2-9-14-11(15)10-13(12(14)16)7-5-3-4-6-8-13/h2H,1,3-10H2
charge 0 multiplicity 1
35 atoms
O  -0.432536 1.745044 0.821102
O  -2.396116 -2.423526 0.002104
N  -1.683293 -0.221229 0.458113
C  0.698807 -0.39672 0.13756
C  1.791512 -0.367307 1.253894
C  1.21398 0.096139 -1.256066
C  0.03547 -1.804622 0.042969
C  2.796235 0.812168 1.225531
C  2.620178 -0.412212 -1.669268
C  -0.48236 0.52706 0.520053
C  4.031151 0.538896 0.329172
C  3.767925 0.516743 -1.195569
C  -1.474377 -1.582256 0.140097
C  -3.024522 0.367032 0.672469
C  -3.695538 0.748483 -0.635715
C  -4.025958 2.018943 -0.970727
H  2.366753 -1.313137 1.188931
H  1.273557 -0.394288 2.23356
H  1.228019 1.203014 -1.254032
H  0.463786 -0.201007 -2.016291
H  0.335846 -2.463269 0.879285
H  0.276218 -2.340185 -0.891145
H  3.15743 0.979777 2.259277
H  2.282539 1.744896 0.926186
H  2.658629 -0.466615 -2.775056
H  2.787871 -1.446983 -1.305723
H  4.472052 -0.43316 0.636113
H  4.803764 1.307005 0.534807
H  3.537718 1.546212 -1.539805
H  4.706316 0.220524 -1.706712
H  -3.628505 -0.391734 1.203668
H  -2.890711 1.252676 1.316618
H  -3.922726 -0.085438 -1.31434
H  -4.526469 2.249078 -1.917985
H  -3.801943 2.864599 -0.309074
