program: Gaussian 09
title: 000056326
version: EM64L-G09RevD.01
frameworkgroup: C1[X(C13H17NO)]
method: RPBEPBE
basis: SDD
operation: Freq
keyword: #p
keyword: freq=noraman
keyword: PBEPBE/SDD
title: #p freq=noraman PBEPBE/SDD
converged: YES YES NO NO
title: Mulliken charges:
elementType: O N C C C C C C C C C C C C C H H H H H H H H H H H H H H H H H
charge: -0.464025 -0.130873 -0.019719 -0.230143 -0.774022 0.402874 -0.430599 -0.646538 -0.391333 -0.401817 -0.233773 -0.225032 -0.246036 0.205052 -0.502698 0.179604 0.209770 0.253699 0.241974 0.219234 0.209439 0.265040 0.193028 0.223074 0.257110 0.271451 0.281779 0.339116 0.223350 0.220779 0.223259 0.276977
chargesum: 0.00000
title: Mulliken charges with hydrogens summed into heavy atoms:
elementType: O N C C C C C C C C C C C C C
charge: -0.124909 -0.130873 0.159885 -0.020373 -0.059114 0.402874 0.043879 0.026674 -0.119882 -0.120038 -0.010423 -0.004253 -0.022777 0.205052 -0.225721
polarizability: 1.70596329e+02 -5.86040858e+00 1.61751196e+02 1.80092846e+01 -6.34724385e+00 9.90471447e+01
1716.lowfreq: -9.1105 -3.6765 -0.0003 0.0006 0.0006 10.9854 24.3025 36.8265 52.2252
frequency: 24.2639 36.5134 52.2183 93.0763 103.1816 129.1501 190.8380 217.8931 234.6232 238.8048 278.2147 285.4328 289.4246 313.2477 324.5697 346.6074 377.7914 403.6760 422.6923 436.1819 476.9475 541.6269 590.8476 616.4278 629.1796 646.9302 662.2537 707.2439 748.9363 777.7689 805.8131 861.9006 871.6347 928.9406 935.3293 955.6988 983.3993 988.8505 990.8408 991.7777 997.6470 1027.2261 1044.0976 1082.8809 1091.3514 1099.0028 1112.4887 1146.2824 1160.1245 1170.4458 1187.5501 1219.0449 1220.0471 1255.3923 1279.1093 1301.8979 1321.7060 1342.9512 1354.7198 1381.2178 1389.9509 1395.8077 1434.0724 1437.7785 1454.5521 1473.5815 1479.5153 1481.2699 1483.6533 1489.5108 1590.6973 1614.3885 2142.9118 2799.3651 2834.4632 2866.7093 2959.9888 2991.2135 3035.7249 3059.4828 3086.8226 3091.4868 3093.1921 3119.2214 3130.9619 3146.4618 3158.5777 3175.8125 3426.4470 3566.9532
redmass: 5.0965 3.8903 3.3649 3.1307 3.5505 3.8959 4.2716 1.0643 4.4394 3.3699 1.2876 2.1364 3.3855 3.9218 1.8821 1.3469 2.9894 2.8809 4.2581 4.5250 3.2183 3.9053 4.1239 6.4057 1.2302 3.6685 1.2469 1.8641 2.1305 3.2942 2.7575 1.2485 2.6961 1.8394 1.8947 1.9652 1.6154 4.8889 3.4637 2.5340 1.3226 2.2076 1.4914 1.6112 1.6653 3.0877 1.4656 1.4144 2.3022 1.0545 1.1276 1.5434 1.9103 1.3689 1.5633 1.1824 1.2850 1.3974 1.3535 5.9818 1.2900 1.6014 1.5230 1.5050 1.0777 1.0532 1.0804 1.1292 1.9076 1.0605 6.2579 6.0368 6.0151 1.0813 1.0711 1.0567 1.0835 1.0359 1.0728 1.0844 1.0994 1.1007 1.0996 1.0846 1.0892 1.0940 1.0986 1.0954 1.1595 1.0658
irintensity: 0.0589 0.1186 1.5720 0.2560 0.7722 0.6066 1.4763 0.7780 1.5572 12.7896 119.1748 10.3500 1.3797 28.0338 10.8407 6.0680 5.5362 0.6266 2.5521 1.3831 1.6524 14.5295 0.2704 0.2197 74.7133 15.3459 65.6358 56.0964 50.1134 17.5471 7.9614 0.5016 18.2560 4.0990 4.2215 13.7813 4.2171 73.7287 2.4738 25.4471 3.1421 13.2788 2.1172 0.7580 39.3587 10.3405 11.0601 77.0562 20.8629 0.4056 8.0084 16.3803 27.7826 5.6292 7.0658 3.9342 3.1592 18.2124 3.3087 6.0057 29.9439 18.4610 15.0853 8.8332 6.7482 13.7416 10.5384 14.0425 12.5425 16.8933 0.3394 7.2420 1.4521 99.9317 95.2497 164.3738 45.1360 19.0075 34.3769 6.5376 27.8529 18.9951 25.8246 0.1586 17.1487 24.8057 24.0794 7.6726 63.2078 5.5750
temp: 298.150 k
press: 1.00000 atm
elementType: 8 7 6 6 6 6 6 6 6 6 6 6 6 6 6 1 1 1 1 1 1 1 1 1 1 1 1 1 1 1 1 1
symmnumber: 1
zpe: 698119.7 jmol-1
zpe.correction: 0.265900 hartree
zpe.thermalcorrener: 0.281668 hartree
zpe.thermalcorrenthalpy: 0.282612 hartree
zpe.thermalcorrgfe: 0.222300 hartree
zpe.sumelectzpe: -634.325825 hartree
zpe.sumelectthermal: -634.310057 hartree
zpe.sumelectthermalent: -634.309113 hartree
zpe.sumelectthermalfe: -634.369425 hartree
dipole: -2.3427 -1.3622 0.2135
dipole: 2.7183
quadrupole: -89.9104 -80.6829 -90.4940
quadrupole: 3.7936 4.2251 -0.1500
quadrupole: -2.8813 6.3462 -3.4649 3.7936 4.2251 -0.1500
hfenergy: -634.5917251 hartree
pointgroup: C01 [X(C13H17N1O1)]
dipole: -0.9238348 0.5273392 0.1105398 debye
polarizability: 165.4692526|9.1622826|162.4350577|-24.679892|2.5749951|103.4903593 unknown
InChI: InChI=1S/C13H17NO/c1-4-10-14(3)11(2)13(15)12-8-6-5-7-9-12/h1,5-9,11,13,15H,10H2,2-3H3
charge 0 multiplicity 1
32 atoms
O  1.371084 2.569214 0.736006
N  -1.714982 0.4351 0.45998
C  -0.748573 1.485277 0.016511
C  0.609755 1.307672 0.799479
C  -0.489916 1.538067 -1.499338
C  1.503136 0.199952 0.254665
C  -2.700124 -0.030563 -0.550273
C  -2.366593 0.776888 1.742439
C  1.090696 -1.154002 0.36104
C  2.743755 0.497901 -0.360377
C  1.90397 -2.190222 -0.149946
C  3.558053 -0.541435 -0.866003
C  3.141839 -1.888772 -0.765333
C  -3.402287 -1.261765 -0.132295
C  -4.018551 -2.281518 0.183719
H  -1.145509 2.492875 0.319431
H  0.362777 1.079633 1.857919
H  0.31593 2.269429 -1.686007
H  -0.147933 0.564614 -1.890734
H  -1.381823 1.864445 -2.062799
H  -3.475758 0.746131 -0.778956
H  -2.169437 -0.241343 -1.493439
H  -3.061894 1.649488 1.653559
H  -1.607209 1.024159 2.503747
H  -2.943019 -0.088517 2.110095
H  0.124672 -1.382153 0.82377
H  3.063469 1.541453 -0.422555
H  0.820568 3.29041 1.132559
H  1.5730 -3.231623 -0.063444
H  4.518756 -0.298453 -1.334957
H  3.775322 -2.693737 -1.155605
H  -4.547075 -3.175906 0.458742
