program: Orca
programVersion: 5.0.2
elementType: S O N C C C C C C C C C C H H H H H H H H H H H H H H H H H H H H H
charge: 0
multiplicity: 1
keywords: wb97x-d3
keywords: def2-TZVPP
keywords: def2/J RIJCOSX
keywords: DEFGRID2
keywords: scfconv7
keywords: smallprint printgap noloewdin
keywords: NOSOSCF
formula: C10H21NOS
InChI: InChI=1/C10H21NOS/c1-4-7-11(8-5-2)10(12)13-9-6-3/h4-9H2,1-3H3
34 atoms
S  -0.926596 -1.390396 0.181236
O  -0.591139 0.643717 -1.462851
N  1.141999 0.268968 -0.054422
C  1.784005 -0.475896 1.020654
C  1.897276 1.407466 -0.573157
C  2.872726 -1.433458 0.554333
C  1.793326 2.658105 0.291442
C  -0.076689 0.007452 -0.554445
C  2.3849 -2.568565 -0.33023
C  0.392821 3.237297 0.408761
C  -2.565488 -1.280529 -0.591018
C  -3.598516 -0.543576 0.247737
C  -3.309166 0.929315 0.475558
H  1.034375 -1.011598 1.603248
H  2.218716 0.252137 1.708695
H  1.57052 1.620816 -1.588742
H  2.943406 1.104981 -0.64441
H  3.658174 -0.872898 0.040931
H  3.338389 -1.842779 1.454086
H  2.192927 2.453046 1.287924
H  2.461058 3.402353 -0.149158
H  3.214712 -3.217485 -0.612513
H  1.644111 -3.183874 0.181287
H  1.931235 -2.204114 -1.252597
H  -0.023908 3.483557 -0.568409
H  -0.296302 2.550881 0.902174
H  0.407419 4.153994 0.999415
H  -2.872729 -2.317305 -0.734263
H  -2.456268 -0.841611 -1.581637
H  -4.558213 -0.649636 -0.265855
H  -3.711341 -1.051434 1.208089
H  -2.37718 1.079447 1.022382
H  -3.239038 1.476322 -0.464743
H  -4.104946 1.387373 1.063338
elementType: S O N C H
totalener: -921.98261420 hartree
nucrepener: 1003.19451132 hartree
electener: -1925.17712552 hartree
oneelecener: -3252.64591465 hartree
twoeener: 1327.46878913 hartree
cpcmener: -0.02042366 hartree
kineticenergy: 918.76058021 hartree
xcener: -71.983489353277 hartree
chargesum: -0.0000000
charge: -0.127536 -0.546736 -0.107305 -0.078065 -0.059798 -0.079867 -0.096432 0.291288 -0.284144 -0.268241 -0.097261 -0.092400 -0.265741 0.103538 0.111893 0.098650 0.109314 0.064432 0.070751 0.063498 0.071655 0.097849 0.081492 0.081822 0.083033 0.073132 0.097121 0.120167 0.102449 0.072119 0.062360 0.066089 0.082303 0.098571
qa: -0.1275 -0.5467 -0.1073 -0.0781 -0.0598 -0.0799 -0.0964 0.2913 -0.2841 -0.2682 -0.0973 -0.0924 -0.2657 0.1035 0.1119 0.0987 0.1093 0.0644 0.0708 0.0635 0.0717 0.0978 0.0815 0.0818 0.0830 0.0731 0.0971 0.1202 0.1024 0.0721 0.0624 0.0661 0.0823 0.0986
va: 2.3406 1.9410 3.1529 3.8787 3.8523 3.8520 3.8768 4.2722 3.9364 3.9258 3.8693 3.8987 3.9344 1.0181 1.0024 1.0237 1.0024 1.0094 1.0133 1.0093 1.0130 1.0065 1.0012 1.0026 1.0054 1.0011 1.0070 1.0075 1.0382 1.0101 1.0127 1.0097 1.0050 1.0079
dispcorr: -0.015519014 hartree
energy: -921.998133217224
dipole: 2.93658 -1.93178 1.00480 5.60398 -5.88102 -0.27704 3.67966 -2.56192 1.11774
magnitude: 1.52831 au
magnitude: 3.88466 debye
