program: Orca
programVersion: 5.0.2
elementType: S O N C C C C C C C C C C H H H H H H H H H H H H H H H H H H H H H
charge: 0
multiplicity: 1
keywords: wb97x-d3
keywords: def2-TZVPP
keywords: def2/J RIJCOSX
keywords: DEFGRID2
keywords: scfconv7
keywords: smallprint printgap noloewdin
keywords: NOSOSCF
formula: C10H21NOS
InChI: InChI=1/C10H21NOS/c1-4-7-11(8-5-2)10(12)13-9-6-3/h4-9H2,1-3H3
34 atoms
S  -0.961159 -1.325346 -0.192729
O  -0.993148 1.311804 -0.110753
N  0.947416 0.361348 0.561465
C  1.773386 -0.826781 0.722992
C  1.573957 1.672694 0.710929
C  2.484792 -1.294063 -0.540674
C  2.063297 2.298223 -0.589798
C  -0.312284 0.318159 0.096051
C  3.223829 -2.599566 -0.296054
C  2.635942 3.685569 -0.346002
C  -2.68544 -0.939943 -0.591908
C  -3.554382 -0.686362 0.628322
C  -4.992747 -0.389724 0.231693
H  1.162117 -1.636203 1.12965
H  2.509036 -0.602918 1.49659
H  2.412735 1.547487 1.39643
H  0.871489 2.346446 1.204463
H  1.759485 -1.423899 -1.347383
H  3.187632 -0.526255 -0.870734
H  2.824896 1.658988 -1.041016
H  1.240914 2.360788 -1.305256
H  2.535408 -3.395661 -0.006903
H  3.750099 -2.92839 -1.19199
H  3.962824 -2.49728 0.500597
H  3.47319 3.654625 0.353538
H  2.998418 4.130219 -1.272693
H  1.883859 4.358459 0.069572
H  -3.038329 -1.819289 -1.134541
H  -2.712063 -0.104709 -1.291879
H  -3.522169 -1.561653 1.280516
H  -3.150731 0.148476 1.203866
H  -5.428113 -1.21414 -0.335559
H  -5.615824 -0.230488 1.112074
H  -5.058324 0.50784 -0.385197
elementType: S O N C H
totalener: -921.98561856 hartree
nucrepener: 965.25886324 hartree
electener: -1887.24448181 hartree
oneelecener: -3176.57131099 hartree
twoeener: 1289.32682918 hartree
cpcmener: -0.02026759 hartree
kineticenergy: 918.76146717 hartree
xcener: -71.979059954010 hartree
chargesum: 0.0000000
charge: -0.126544 -0.557626 -0.129429 -0.078315 -0.045858 -0.090758 -0.095958 0.316692 -0.276799 -0.274904 -0.079674 -0.106401 -0.273138 0.104011 0.108262 0.102388 0.095934 0.061536 0.078088 0.070115 0.067505 0.084274 0.093429 0.083602 0.081893 0.092402 0.084351 0.123199 0.095426 0.063732 0.069608 0.082360 0.092421 0.084178
qa: -0.1265 -0.5576 -0.1294 -0.0783 -0.0459 -0.0908 -0.0960 0.3167 -0.2768 -0.2749 -0.0797 -0.1064 -0.2731 0.1040 0.1083 0.1024 0.0959 0.0615 0.0781 0.0701 0.0675 0.0843 0.0934 0.0836 0.0819 0.0924 0.0844 0.1232 0.0954 0.0637 0.0696 0.0824 0.0924 0.0842
va: 2.3605 1.9339 3.2099 3.8637 3.8309 3.8250 3.8491 4.2490 3.9533 3.9493 3.8757 3.8832 3.9500 1.0107 1.0025 1.0045 1.0155 1.0291 1.0127 1.0117 1.0212 1.0012 1.0028 1.0011 1.0010 1.0026 1.0012 1.0075 1.0345 1.0151 1.0202 1.0004 1.0038 1.0008
dispcorr: -0.013232618 hartree
energy: -921.998851183132
dipole: 5.76762 -4.58718 1.18044 2.54215 -3.32726 -0.78511 -0.38068 0.69581 0.31513
magnitude: 1.45229 au
magnitude: 3.69143 debye
