program: Orca
programVersion: 5.0.2
elementType: S O N C C C C C C C C C C H H H H H H H H H H H H H H H H H H H H H
charge: 0
multiplicity: 1
keywords: wb97x-d3
keywords: def2-TZVPP
keywords: def2/J RIJCOSX
keywords: DEFGRID2
keywords: scfconv7
keywords: smallprint printgap noloewdin
keywords: NOSOSCF
formula: C10H21NOS
InChI: InChI=1/C10H21NOS/c1-4-7-11(8-5-2)10(12)13-9-6-3/h4-9H2,1-3H3
34 atoms
S  -1.059104 -1.11122 0.763811
O  -0.857424 1.508437 0.978068
N  1.116513 0.413698 0.739284
C  1.832466 -0.811598 0.416974
C  1.906488 1.62424 0.936885
C  1.84862 -1.164742 -1.067181
C  2.485883 2.222902 -0.337879
C  -0.224954 0.47905 0.822409
C  2.561515 -2.484298 -1.313124
C  1.441478 2.648577 -1.356629
C  -2.788254 -0.575159 0.882173
C  -3.405012 -0.160931 -0.443966
C  -3.545943 -1.30879 -1.429616
H  1.425882 -1.645752 0.996953
H  2.856178 -0.686834 0.774629
H  2.71934 1.374747 1.623409
H  1.287486 2.363524 1.442381
H  0.82513 -1.224281 -1.444371
H  2.341925 -0.368426 -1.628546
H  3.081064 3.089771 -0.037555
H  3.191315 1.522785 -0.793136
H  2.059483 -3.310307 -0.805345
H  2.588459 -2.722607 -2.376932
H  3.593736 -2.456968 -0.957966
H  1.91552 3.087426 -2.235749
H  0.838745 1.806944 -1.702677
H  0.761243 3.395746 -0.944248
H  -2.852394 0.219832 1.623965
H  -3.314809 -1.437805 1.296318
H  -4.39309 0.255825 -0.227396
H  -2.822679 0.650194 -0.886176
H  -2.576714 -1.736395 -1.692755
H  -4.160589 -2.111371 -1.016318
H  -4.017927 -0.977251 -2.355221
elementType: S O N C H
totalener: -921.99316732 hartree
nucrepener: 991.49347749 hartree
electener: -1913.48664481 hartree
oneelecener: -3228.98335643 hartree
twoeener: 1315.49671162 hartree
cpcmener: -0.01583215 hartree
kineticenergy: 918.74811435 hartree
xcener: -71.977488996987 hartree
chargesum: -0.0000000
charge: -0.136337 -0.517088 -0.113964 -0.093247 -0.062677 -0.082518 -0.107239 0.297165 -0.276869 -0.276228 -0.095625 -0.114042 -0.256741 0.105703 0.109356 0.101459 0.099056 0.064145 0.070489 0.077302 0.071630 0.083621 0.092949 0.082107 0.096048 0.077145 0.088122 0.111769 0.117405 0.073011 0.069367 0.072254 0.080272 0.092200
qa: -0.1363 -0.5171 -0.1140 -0.0932 -0.0627 -0.0825 -0.1072 0.2972 -0.2769 -0.2762 -0.0956 -0.1140 -0.2567 0.1057 0.1094 0.1015 0.0991 0.0641 0.0705 0.0773 0.0716 0.0836 0.0929 0.0821 0.0960 0.0771 0.0881 0.1118 0.1174 0.0730 0.0694 0.0723 0.0803 0.0922
va: 2.3338 1.9797 3.1503 3.8637 3.8568 3.8358 3.8561 4.2743 3.9603 3.9309 3.8780 3.8923 3.9322 1.0048 0.9983 1.0049 1.0252 1.0244 1.0100 1.0133 1.0033 1.0018 1.0028 1.0012 1.0051 1.0012 1.0054 1.0345 1.0081 1.0084 1.0184 1.0121 1.0017 1.0047
dispcorr: -0.014580319 hartree
energy: -922.007747638568
dipole: 5.16413 -4.08627 1.07786 -0.70322 0.01013 -0.69309 -11.06935 10.73921 -0.33014
magnitude: 1.32331 au
magnitude: 3.36359 debye
