program: Orca
programVersion: 5.0.2
elementType: S O N C C C C C C C C C C H H H H H H H H H H H H H H H H H H H H H
charge: 0
multiplicity: 1
keywords: wb97x-d3
keywords: def2-TZVPP
keywords: def2/J RIJCOSX
keywords: DEFGRID2
keywords: scfconv7
keywords: smallprint printgap noloewdin
keywords: NOSOSCF
formula: C10H21NOS
InChI: InChI=1/C10H21NOS/c1-4-7-11(8-5-2)10(12)13-9-6-3/h4-9H2,1-3H3
34 atoms
S  -1.073334 -1.324318 0.020663
O  -0.646908 0.970946 1.247779
N  1.06482 0.269229 -0.04819
C  1.644191 -0.636008 -1.028088
C  1.850521 1.449862 0.29348
C  2.739799 -1.538657 -0.472032
C  1.517143 2.670148 -0.556192
C  -0.164717 0.153579 0.482866
C  2.276991 -2.502275 0.607513
C  2.404488 3.852579 -0.197468
C  -2.647221 -1.016484 0.868454
C  -3.620014 -0.139059 0.096756
C  -4.111138 -0.768642 -1.196631
H  2.052971 -0.027917 -1.839391
H  0.859455 -1.239924 -1.485234
H  2.902622 1.190734 0.163017
H  1.722686 1.678721 1.35218
H  3.149859 -2.099397 -1.31601
H  3.563049 -0.927203 -0.09236
H  1.640947 2.422082 -1.614093
H  0.46811 2.94055 -0.417433
H  1.873202 -1.979096 1.475549
H  1.505355 -3.180024 0.240075
H  3.110069 -3.113222 0.957893
H  2.27782 4.143209 0.84728
H  3.460594 3.620524 -0.348806
H  2.169371 4.723886 -0.809441
H  -2.433782 -0.610427 1.856566
H  -3.07153 -2.011554 1.020081
H  -4.473824 0.053527 0.753095
H  -3.164039 0.832784 -0.103529
H  -4.835876 -0.124186 -1.695511
H  -3.293057 -0.944123 -1.897084
H  -4.598754 -1.727806 -1.009319
elementType: S O N C H
totalener: -921.99386572 hartree
nucrepener: 978.33112077 hartree
electener: -1900.32498649 hartree
oneelecener: -3202.69159306 hartree
twoeener: 1302.36660657 hartree
cpcmener: -0.01578665 hartree
kineticenergy: 918.74430585 hartree
xcener: -71.976312016988 hartree
chargesum: -0.0000000
charge: -0.133234 -0.522329 -0.126963 -0.081752 -0.057981 -0.083237 -0.078154 0.304197 -0.283450 -0.274006 -0.096653 -0.114138 -0.256521 0.109977 0.103532 0.104583 0.094007 0.071418 0.064033 0.060629 0.065549 0.082165 0.081299 0.097522 0.083468 0.080522 0.091639 0.110608 0.117815 0.072190 0.069291 0.091816 0.072003 0.080156
qa: -0.1332 -0.5223 -0.1270 -0.0818 -0.0580 -0.0832 -0.0782 0.3042 -0.2835 -0.2740 -0.0967 -0.1141 -0.2565 0.1100 0.1035 0.1046 0.0940 0.0714 0.0640 0.0606 0.0655 0.0822 0.0813 0.0975 0.0835 0.0805 0.0916 0.1106 0.1178 0.0722 0.0693 0.0918 0.0720 0.0802
va: 2.3385 1.9785 3.1597 3.8891 3.8430 3.8434 3.8539 4.2675 3.9367 3.9424 3.8762 3.8953 3.9245 1.0019 1.0164 0.9976 1.0193 1.0137 1.0093 1.0136 1.0209 1.0033 1.0023 1.0062 1.0007 1.0015 1.0033 1.0350 1.0070 1.0087 1.0172 1.0048 1.0171 1.0013
dispcorr: -0.013772926 hartree
energy: -922.007638647010
dipole: 4.82563 -3.93365 0.89198 3.56621 -3.98868 -0.42248 -3.96414 3.05402 -0.91012
magnitude: 1.34255 au
magnitude: 3.41249 debye
