program: Gaussian 09
title: 000006423
version: EM64L-G09RevD.01
frameworkgroup: C1[X(CCl3NO2)]
method: RPBEPBE
basis: SDD
operation: Freq
keyword: #p
keyword: freq=noraman
keyword: PBEPBE/SDD
title: #p freq=noraman PBEPBE/SDD
converged: NO NO NO NO
title: Mulliken charges:
elementType: Cl Cl Cl O O N C
charge: 0.185023 0.185194 0.194923 -0.131625 -0.133060 0.220302 -0.520756
chargesum: 0.00000
title: Mulliken charges with hydrogens summed into heavy atoms:
polarizability: 4.77593940e+01 -3.94335254e+00 6.58949656e+01 1.29757328e-02 -4.37723687e-04 5.06565457e+01
1716.lowfreq: -0.0029 -0.0010 0.0011 10.5371 11.8480 14.0570 33.9092 180.8078 185.0210
frequency: 32.3916 180.8070 185.0210 255.5284 267.0162 267.3428 382.0364 397.9052 599.7405 629.3912 739.1467 761.5281 787.8930 1177.6391 1460.6427
redmass: 17.1654 25.1902 25.8095 25.0042 29.4763 20.2897 29.1293 18.8217 14.8762 13.1679 14.8705 13.0663 12.7685 15.1521 14.6081
irintensity: 0.2011 1.2389 0.3546 0.4944 0.5929 0.2204 0.9449 5.7836 66.5474 38.2091 35.2701 153.3740 164.8692 115.7411 127.1718
temp: 298.150 k
press: 1.00000 atm
elementType: 17 17 17 8 8 7 6
symmnumber: 1
zpe: 48592.5 jmol-1
zpe.correction: 0.018508 hartree
zpe.thermalcorrener: 0.026031 hartree
zpe.thermalcorrenthalpy: 0.026975 hartree
zpe.thermalcorrgfe: -0.015475 hartree
zpe.sumelectzpe: -1622.814138 hartree
zpe.sumelectthermal: -1622.806616 hartree
zpe.sumelectthermalent: -1622.805672 hartree
zpe.sumelectthermalfe: -1622.848121 hartree
dipole: -1.8177 -0.1751 0.0011
dipole: 1.8261
quadrupole: -64.0495 -61.4283 -57.0262
quadrupole: -0.5686 0.0021 0.0009
quadrupole: -3.2148 -0.5936 3.8085 -0.5686 0.0021 0.0009
hfenergy: -1622.8326463 hartree
pointgroup: C01 [X(C1Cl3N1O2)]
dipole: 0.7180238 0.0243955 0.0040436 debye
dipolederiv: -0.1479279 0.0586873 -0.1169545 0.0988793 -0.2470515 0.2805056 -0.1490332 0.2540494 -0.5740759 -0.150755 0.0615678 0.1213435 0.1020416 -0.2477372 -0.2798456 0.1534007 -0.2538468 -0.570301 -0.2128635 -0.2454968 -0.0005086 -0.2977138 -0.6286549 -0.001374 -0.0004105 -0.0010345 -0.1020678 -0.6580657 -0.2202129 -0.002483 -0.1234939 -0.5986833 0.0005789 -0.0033768 -0.0008251 -0.1177559 -0.5933337 0.2414597 -0.003167 0.1287885 -0.6468491 0.0014854 -0.003479 0.0029874 -0.1125364 1.2938034 -0.0544119 0.0077523 -0.052244 1.0172391 -0.0024238 0.0084931 -0.0024701 -0.0787302 0.4691424 0.1584068 -0.0059827 0.1437422 1.3517371 0.0010735 -0.0055944 0.0011398 1.5554672 unknown
polarizability: 47.0503898|1.4796189|66.6039145|-0.013653|-0.0271546|50.6566011 unknown
InChI: InChI=1S/CCl3NO2/c2-1(3,4)5(6)7
charge 0 multiplicity 1
7 atoms
Cl 1.084438 -0.945145 1.525703
Cl 1.101023 -0.947095 -1.511991
Cl 1.33134 1.661865 0.006313
O  -1.599182 -1.055076 -0.007177
O  -1.528991 1.231141 -0.011334
N  -1.008714 0.073119 -0.005008
C  0.619986 -0.018809 0.003595
