program: Orca
programVersion: 5.0.2
elementType: S O N C C C C C C C C C C H H H H H H H H H H H H H H H H H H H H H
charge: 0
multiplicity: 1
keywords: wb97x-d3
keywords: def2-TZVPP
keywords: def2/J RIJCOSX
keywords: DEFGRID2
keywords: scfconv7
keywords: smallprint printgap noloewdin
keywords: NOSOSCF
formula: C10H21NOS
InChI: InChI=1/C10H21NOS/c1-4-7-11(8-5-2)10(12)13-9-6-3/h4-9H2,1-3H3
34 atoms
S  -1.197095 -0.690874 0.023067
O  -0.745435 1.859861 0.475982
N  1.058902 0.503598 0.736258
C  1.656903 -0.816182 0.604997
C  1.920677 1.596804 1.170336
C  2.060894 -1.203423 -0.81407
C  2.883595 2.105349 0.103759
C  -0.230636 0.755917 0.442968
C  2.632553 -2.611876 -0.852392
C  2.203341 2.619799 -1.154732
C  -2.828169 0.066393 -0.236529
C  -3.822839 -1.006896 -0.657743
C  -4.096838 -2.059303 0.406346
H  0.980821 -1.570677 1.018757
H  2.53772 -0.83191 1.249364
H  2.489899 1.240715 2.031463
H  1.295094 2.413338 1.524557
H  1.196822 -1.13881 -1.478492
H  2.800292 -0.494145 -1.191412
H  3.468803 2.908009 0.560515
H  3.601545 1.321789 -0.152814
H  1.901296 -3.347684 -0.512819
H  2.931032 -2.887723 -1.863802
H  3.513361 -2.702431 -0.213689
H  2.94146 2.994576 -1.865177
H  1.637484 1.83642 -1.661622
H  1.515465 3.437271 -0.934044
H  -2.744612 0.828021 -1.010883
H  -3.154095 0.547783 0.685986
H  -4.754432 -0.491629 -0.904518
H  -3.485405 -1.483783 -1.581532
H  -4.426969 -1.600245 1.339996
H  -4.881829 -2.742218 0.079511
H  -3.215372 -2.662234 0.628462
elementType: S O N C H
totalener: -921.99234889 hartree
nucrepener: 979.95659085 hartree
electener: -1901.94893974 hartree
oneelecener: -3205.87047633 hartree
twoeener: 1303.92153658 hartree
cpcmener: -0.01662681 hartree
kineticenergy: 918.75743535 hartree
xcener: -71.979771447249 hartree
chargesum: -0.0000000
charge: -0.131942 -0.517900 -0.110839 -0.096267 -0.061665 -0.081726 -0.107949 0.306400 -0.277141 -0.275644 -0.100783 -0.112078 -0.258779 0.106137 0.108589 0.101009 0.100117 0.063066 0.070534 0.077406 0.071163 0.083771 0.092745 0.082083 0.096010 0.076751 0.087606 0.108824 0.099460 0.078971 0.069162 0.082059 0.092130 0.078720
qa: -0.1319 -0.5179 -0.1108 -0.0963 -0.0617 -0.0817 -0.1079 0.3064 -0.2771 -0.2756 -0.1008 -0.1121 -0.2588 0.1061 0.1086 0.1010 0.1001 0.0631 0.0705 0.0774 0.0712 0.0838 0.0927 0.0821 0.0960 0.0768 0.0876 0.1088 0.0995 0.0790 0.0692 0.0821 0.0921 0.0787
va: 2.3703 1.9859 3.1501 3.8650 3.8561 3.8211 3.8527 4.2795 3.9601 3.9297 3.9510 3.9102 3.9305 1.0069 0.9981 1.0055 1.0252 1.0324 1.0099 1.0135 1.0033 1.0016 1.0029 1.0013 1.0054 1.0011 1.0064 1.0162 1.0144 1.0060 1.0150 1.0017 1.0045 1.0064
dispcorr: -0.013939479 hartree
energy: -922.006288373683
dipole: 5.86508 -4.94170 0.92338 -4.44571 3.48614 -0.95957 -4.22349 4.21681 -0.00668
magnitude: 1.33171 au
magnitude: 3.38493 debye
