program: Orca
programVersion: 5.0.2
elementType: S O N C C C C C C C C C C H H H H H H H H H H H H H H H H H H H H H
charge: 0
multiplicity: 1
keywords: wb97x-d3
keywords: def2-TZVPP
keywords: def2/J RIJCOSX
keywords: DEFGRID2
keywords: scfconv7
keywords: smallprint printgap noloewdin
keywords: NOSOSCF
formula: C10H21NOS
InChI: InChI=1/C10H21NOS/c1-4-7-11(8-5-2)10(12)13-9-6-3/h4-9H2,1-3H3
34 atoms
S  -1.178792 -0.546767 -0.32735
O  -0.601264 1.562415 1.135578
N  1.193903 0.47989 0.26432
C  1.744404 -0.628477 -0.497681
C  2.153606 1.396451 0.866763
C  1.986523 -1.880482 0.335817
C  2.693003 2.435958 -0.109598
C  -0.12229 0.661379 0.469211
C  2.590654 -2.995217 -0.503336
C  1.628701 3.3409 -0.710654
C  -2.812834 0.067174 0.178945
C  -3.896694 -0.762171 -0.493794
C  -3.928546 -2.221962 -0.066159
H  2.686452 -0.289988 -0.933191
H  1.101324 -0.855142 -1.351615
H  2.980158 0.800472 1.258963
H  1.69231 1.887214 1.721686
H  2.653595 -1.63708 1.167243
H  1.044739 -2.214625 0.777375
H  3.426678 3.037755 0.433536
H  3.248328 1.938059 -0.909844
H  3.546032 -2.694706 -0.937999
H  2.76976 -3.88823 0.095805
H  1.929697 -3.278749 -1.324632
H  0.911944 2.780816 -1.313705
H  1.071701 3.876858 0.05933
H  2.083077 4.085554 -1.365472
H  -2.901403 1.112728 -0.113813
H  -2.901568 0.006443 1.264149
H  -4.851406 -0.292255 -0.24529
H  -3.796877 -0.68929 -1.579884
H  -3.026762 -2.75986 -0.363347
H  -4.026136 -2.315048 1.01721
H  -4.775748 -2.738246 -0.519433
elementType: S O N C H
totalener: -921.99358058 hartree
nucrepener: 973.79169632 hartree
electener: -1895.78527690 hartree
oneelecener: -3193.55465727 hartree
twoeener: 1297.76938037 hartree
cpcmener: -0.01682948 hartree
kineticenergy: 918.75059694 hartree
xcener: -71.977796170845 hartree
chargesum: -0.0000000
charge: -0.135785 -0.519251 -0.112519 -0.095694 -0.058899 -0.067523 -0.093376 0.305755 -0.275060 -0.274315 -0.096448 -0.113419 -0.257538 0.113067 0.101160 0.105479 0.098521 0.066347 0.056564 0.070541 0.060569 0.081821 0.092465 0.083058 0.078251 0.083694 0.095633 0.108595 0.097572 0.079532 0.069065 0.078176 0.081846 0.092116
qa: -0.1358 -0.5193 -0.1125 -0.0957 -0.0589 -0.0675 -0.0934 0.3058 -0.2751 -0.2743 -0.0964 -0.1134 -0.2575 0.1131 0.1012 0.1055 0.0985 0.0663 0.0566 0.0705 0.0606 0.0818 0.0925 0.0831 0.0783 0.0837 0.0956 0.1086 0.0976 0.0795 0.0691 0.0782 0.0818 0.0921
va: 2.3648 1.9852 3.1520 3.8849 3.8565 3.8328 3.8680 4.2831 3.9427 3.9279 3.9509 3.9107 3.9310 0.9950 1.0092 1.0019 1.0239 1.0143 1.0299 1.0137 1.0099 1.0017 1.0035 1.0011 1.0028 1.0061 1.0056 1.0166 1.0153 1.0057 1.0150 1.0063 1.0017 1.0045
dispcorr: -0.013397734 hartree
energy: -922.006978312735
dipole: 4.72502 -3.81038 0.91464 -4.11970 3.31461 -0.80508 -3.11550 2.53155 -0.58395
magnitude: 1.35119 au
magnitude: 3.43446 debye
