program: Orca
programVersion: 5.0.2
elementType: S O N C C C C C C C C C C H H H H H H H H H H H H H H H H H H H H H
charge: 0
multiplicity: 1
keywords: wb97x-d3
keywords: def2-TZVPP
keywords: def2/J RIJCOSX
keywords: DEFGRID2
keywords: scfconv7
keywords: smallprint printgap noloewdin
keywords: NOSOSCF
formula: C10H21NOS
InChI: InChI=1/C10H21NOS/c1-4-7-11(8-5-2)10(12)13-9-6-3/h4-9H2,1-3H3
34 atoms
S  -1.06509 -0.645767 -1.095948
O  -0.849858 1.100184 0.866982
N  1.120819 0.348461 0.045012
C  1.855746 -0.556878 -0.829017
C  1.871102 1.245819 0.921522
C  1.999762 -1.973201 -0.281846
C  1.927647 2.686171 0.423999
C  -0.221676 0.396133 0.095663
C  2.756938 -2.05545 1.034335
C  2.589952 2.844015 -0.935974
C  -2.789743 -0.366144 -0.616747
C  -3.234224 -1.196461 0.576581
C  -4.692377 -0.931792 0.922894
H  2.843315 -0.122588 -0.985764
H  1.391055 -0.580457 -1.81793
H  2.882596 0.847758 0.999189
H  1.448439 1.214054 1.926658
H  1.012481 -2.42641 -0.169559
H  2.521301 -2.560865 -1.041775
H  0.921655 3.109678 0.399002
H  2.481734 3.263005 1.169404
H  2.241368 -1.525675 1.836564
H  2.862852 -3.093394 1.352605
H  3.761542 -1.636425 0.947626
H  3.619077 2.479018 -0.926561
H  2.05124 2.305113 -1.717195
H  2.618787 3.893506 -1.2325
H  -3.362985 -0.638744 -1.505007
H  -2.944443 0.700072 -0.452421
H  -3.093162 -2.255725 0.348698
H  -2.604067 -0.973921 1.439707
H  -5.349211 -1.146519 0.077694
H  -5.01577 -1.555879 1.756836
H  -4.851031 0.109242 1.20982
elementType: S O N C H
totalener: -921.99341513 hartree
nucrepener: 982.18036641 hartree
electener: -1904.17378154 hartree
oneelecener: -3210.35506296 hartree
twoeener: 1306.18128142 hartree
cpcmener: -0.01565269 hartree
kineticenergy: 918.75121350 hartree
xcener: -71.976569325719 hartree
chargesum: -0.0000000
charge: -0.134722 -0.521676 -0.125012 -0.087561 -0.070609 -0.093170 -0.090701 0.311134 -0.276431 -0.283104 -0.077589 -0.110366 -0.270736 0.112386 0.107586 0.106072 0.101451 0.061047 0.069473 0.066252 0.071881 0.082327 0.097161 0.084796 0.083823 0.080511 0.096881 0.120868 0.096312 0.063164 0.072037 0.079976 0.091912 0.084625
qa: -0.1347 -0.5217 -0.1250 -0.0876 -0.0706 -0.0932 -0.0907 0.3111 -0.2764 -0.2831 -0.0776 -0.1104 -0.2707 0.1124 0.1076 0.1061 0.1015 0.0610 0.0695 0.0663 0.0719 0.0823 0.0972 0.0848 0.0838 0.0805 0.0969 0.1209 0.0963 0.0632 0.0720 0.0800 0.0919 0.0846
va: 2.3503 1.9808 3.1081 3.8692 3.8628 3.8769 3.8685 4.2747 3.9229 3.9289 3.8705 3.8855 3.9516 0.9920 1.0079 0.9937 1.0166 1.0268 1.0153 1.0208 1.0128 1.0016 1.0069 0.9990 0.9994 1.0010 1.0067 1.0083 1.0350 1.0144 1.0205 1.0007 1.0038 1.0009
dispcorr: -0.014258768 hartree
energy: -922.007673898590
dipole: 5.29785 -4.21715 1.08070 -0.74297 0.13359 -0.60938 3.55642 -4.03375 -0.47734
magnitude: 1.32932 au
magnitude: 3.37887 debye
