program: Orca
programVersion: 5.0.2
elementType: S O N C C C C C C C C C C H H H H H H H H H H H H H H H H H H H H H
charge: 0
multiplicity: 1
keywords: wb97x-d3
keywords: def2-TZVPP
keywords: def2/J RIJCOSX
keywords: DEFGRID2
keywords: scfconv7
keywords: smallprint printgap noloewdin
keywords: NOSOSCF
formula: C10H21NOS
InChI: InChI=1/C10H21NOS/c1-4-7-11(8-5-2)10(12)13-9-6-3/h4-9H2,1-3H3
34 atoms
S  -1.130426 -1.125332 -0.434789
O  -0.981535 1.502015 -0.256452
N  0.847558 0.395823 0.48516
C  1.552811 -0.853859 0.724427
C  1.549633 1.651337 0.733233
C  2.354891 -1.375226 -0.461954
C  2.181841 2.278173 -0.503478
C  -0.388041 0.459623 -0.042838
C  2.987396 -2.721037 -0.145793
C  2.874794 3.588423 -0.162904
C  -2.789486 -0.595007 -0.939152
C  -3.739828 -0.31992 0.215444
C  -4.051167 -1.545485 1.057265
H  0.841158 -1.613345 1.057838
H  2.219316 -0.690817 1.573166
H  2.323606 1.442554 1.473267
H  0.861503 2.360402 1.197483
H  1.703562 -1.466908 -1.334636
H  3.131685 -0.653717 -0.725267
H  2.90337 1.58308 -0.939033
H  1.41686 2.453334 -1.263052
H  2.229241 -3.473018 0.081978
H  3.57199 -3.090204 -0.988858
H  3.657139 -2.65741 0.714214
H  3.654633 3.446809 0.588262
H  3.346068 4.025148 -1.043988
H  2.169242 4.323434 0.229323
H  -3.161053 -1.420219 -1.550982
H  -2.692855 0.267973 -1.596878
H  -3.339127 0.478166 0.843722
H  -4.666187 0.069558 -0.217124
H  -4.758694 -1.304572 1.851683
H  -4.493614 -2.339951 0.452582
H  -3.154764 -1.948997 1.530884
elementType: S O N C H
totalener: -921.99406676 hartree
nucrepener: 971.29048580 hartree
electener: -1893.28455256 hartree
oneelecener: -3188.56025206 hartree
twoeener: 1295.27569950 hartree
cpcmener: -0.01583784 hartree
kineticenergy: 918.75172139 hartree
xcener: -71.976546295644 hartree
chargesum: -0.0000000
charge: -0.133464 -0.522735 -0.127685 -0.089823 -0.045268 -0.083079 -0.092183 0.306427 -0.275634 -0.272785 -0.093770 -0.115607 -0.257237 0.102255 0.106313 0.097877 0.095966 0.061221 0.075144 0.065778 0.068121 0.084211 0.092587 0.081951 0.079796 0.091726 0.084371 0.118040 0.110011 0.069918 0.072991 0.091586 0.080527 0.072454
qa: -0.1335 -0.5227 -0.1277 -0.0898 -0.0453 -0.0831 -0.0922 0.3064 -0.2756 -0.2728 -0.0938 -0.1156 -0.2572 0.1023 0.1063 0.0979 0.0960 0.0612 0.0751 0.0658 0.0681 0.0842 0.0926 0.0820 0.0798 0.0917 0.0844 0.1180 0.1100 0.0699 0.0730 0.0916 0.0805 0.0725
va: 2.3384 1.9795 3.1957 3.8750 3.8329 3.8228 3.8518 4.2670 3.9530 3.9488 3.8825 3.8900 3.9279 1.0122 1.0027 1.0043 1.0167 1.0282 1.0130 1.0120 1.0209 1.0014 1.0033 1.0012 1.0014 1.0028 1.0013 1.0075 1.0338 1.0184 1.0081 1.0048 1.0012 1.0156
dispcorr: -0.013384568 hartree
energy: -922.007451332742
dipole: 7.48286 -6.48502 0.99784 -0.14822 -0.60517 -0.75339 2.17513 -1.81715 0.35798
magnitude: 1.30055 au
magnitude: 3.30573 debye
