program: Orca
programVersion: 5.0.2
elementType: S O N C C C C C C C C C C H H H H H H H H H H H H H H H H H H H H H
charge: 0
multiplicity: 1
keywords: wb97x-d3
keywords: def2-TZVPP
keywords: def2/J RIJCOSX
keywords: DEFGRID2
keywords: scfconv7
keywords: smallprint printgap noloewdin
keywords: NOSOSCF
formula: C10H21NOS
InChI: InChI=1/C10H21NOS/c1-4-7-11(8-5-2)10(12)13-9-6-3/h4-9H2,1-3H3
34 atoms
S  -1.109052 -0.543995 -0.944995
O  -0.867662 1.530045 0.667373
N  1.072354 0.459513 0.187352
C  1.776929 -0.661609 -0.413498
C  1.880506 1.387222 0.970919
C  1.832228 -1.889817 0.485382
C  2.609246 2.416898 0.115918
C  -0.257258 0.637783 0.105569
C  2.589436 -3.031103 -0.173586
C  1.69082 3.326313 -0.684736
C  -2.831332 -0.049465 -0.663394
C  -3.449024 -0.636101 0.596013
C  -3.584133 -2.148982 0.558488
H  2.790826 -0.326102 -0.640345
H  1.337917 -0.912347 -1.381772
H  2.606585 0.799645 1.537555
H  1.246257 1.885061 1.702479
H  2.31222 -1.622548 1.430965
H  0.815806 -2.208808 0.728796
H  3.227724 3.01637 0.789399
H  3.305508 1.909268 -0.55805
H  2.632261 -3.903679 0.478799
H  2.11127 -3.340867 -1.104807
H  3.617126 -2.747155 -0.408874
H  1.09507 2.76838 -1.409046
H  1.003262 3.874401 -0.038505
H  2.269718 4.061423 -1.24564
H  -3.363589 -0.401721 -1.54998
H  -2.886396 1.038376 -0.672672
H  -2.87033 -0.328079 1.469628
H  -4.439112 -0.185392 0.712331
H  -4.186437 -2.471456 -0.293599
H  -2.61225 -2.639798 0.481695
H  -4.067052 -2.52239 1.462361
elementType: S O N C H
totalener: -921.99458296 hartree
nucrepener: 982.99551843 hartree
electener: -1904.99010139 hartree
oneelecener: -3212.00072667 hartree
twoeener: 1307.01062528 hartree
cpcmener: -0.01612004 hartree
kineticenergy: 918.74848314 hartree
xcener: -71.977010073554 hartree
chargesum: -0.0000000
charge: -0.138833 -0.519387 -0.112944 -0.093989 -0.057651 -0.065881 -0.092248 0.292991 -0.274911 -0.272253 -0.094525 -0.114375 -0.257725 0.112607 0.102723 0.104866 0.099316 0.066957 0.055401 0.069420 0.060576 0.092377 0.082846 0.081800 0.077350 0.083191 0.094876 0.118297 0.110918 0.069140 0.073549 0.080493 0.072739 0.092290
qa: -0.1388 -0.5194 -0.1129 -0.0940 -0.0577 -0.0659 -0.0922 0.2930 -0.2749 -0.2723 -0.0945 -0.1144 -0.2577 0.1126 0.1027 0.1049 0.0993 0.0670 0.0554 0.0694 0.0606 0.0924 0.0828 0.0818 0.0774 0.0832 0.0949 0.1183 0.1109 0.0691 0.0735 0.0805 0.0727 0.0923
va: 2.3260 1.9806 3.1537 3.8901 3.8518 3.8443 3.8727 4.2811 3.9428 3.9289 3.8774 3.8920 3.9332 0.9954 1.0046 1.0023 1.0243 1.0141 1.0243 1.0136 1.0103 1.0034 1.0012 1.0015 1.0035 1.0054 1.0053 1.0074 1.0350 1.0183 1.0080 1.0014 1.0120 1.0047
dispcorr: -0.013968631 hartree
energy: -922.008551587464
dipole: 5.73077 -4.65142 1.07935 -4.08793 3.28320 -0.80473 1.89369 -2.08286 -0.18916
magnitude: 1.35955 au
magnitude: 3.45570 debye
