program: Orca
programVersion: 5.0.2
elementType: S O N C C C C C C C C C C H H H H H H H H H H H H H H H H H H H H H
charge: 0
multiplicity: 1
keywords: wb97x-d3
keywords: def2-TZVPP
keywords: def2/J RIJCOSX
keywords: DEFGRID2
keywords: scfconv7
keywords: smallprint printgap noloewdin
keywords: NOSOSCF
formula: C10H21NOS
InChI: InChI=1/C10H21NOS/c1-4-7-11(8-5-2)10(12)13-9-6-3/h4-9H2,1-3H3
34 atoms
S  -1.026153 -1.091167 -0.498131
O  -1.084075 1.508063 -0.011895
N  0.823369 0.451219 0.621231
C  1.595602 -0.77298 0.726973
C  1.414674 1.674362 1.142659
C  2.359633 -1.17593 -0.531919
C  2.53394 2.248025 0.281062
C  -0.420457 0.502957 0.084641
C  3.089194 -2.495499 -0.331841
C  2.097766 2.588114 -1.135228
C  -2.713285 -0.652333 -0.99514
C  -3.772255 -1.077713 0.012729
C  -3.646866 -0.402166 1.368128
H  0.941797 -1.593373 1.037445
H  2.302236 -0.635542 1.549636
H  1.795891 1.463213 2.146334
H  0.622386 2.412167 1.251782
H  1.665774 -1.261065 -1.370317
H  3.072959 -0.392713 -0.797447
H  2.899062 3.148195 0.783254
H  3.383079 1.558862 0.258248
H  2.390808 -3.303366 -0.107954
H  3.642724 -2.780025 -1.225839
H  3.803547 -2.439576 0.491649
H  2.913344 3.04399 -1.696531
H  1.780819 1.699489 -1.68161
H  1.259614 3.285048 -1.134587
H  -2.876468 -1.147416 -1.953078
H  -2.736246 0.423545 -1.168917
H  -4.748263 -0.846321 -0.424666
H  -3.745283 -2.163374 0.134645
H  -3.670855 0.683387 1.275981
H  -4.46113 -0.703663 2.026977
H  -2.710893 -0.671854 1.857565
totalener: -921.97766598 hartree
nucrepener: 991.62820303 hartree
electener: -1913.60586901 hartree
oneelecener: -3228.96407673 hartree
twoeener: 1315.35820772 hartree
kineticenergy: 918.78418820 hartree
xcener: -71.981237265889 hartree
chargesum: 0.0000000
charge: -0.126644 -0.415526 -0.116281 -0.126166 -0.071426 -0.075906 -0.116717 0.278846 -0.259328 -0.248104 -0.119949 -0.099170 -0.251359 0.105621 0.092320 0.086793 0.105794 0.070362 0.062977 0.071785 0.060484 0.082713 0.088787 0.072387 0.088370 0.072317 0.095142 0.106951 0.113352 0.063846 0.059052 0.090855 0.085648 0.072175
qa: -0.1266 -0.4155 -0.1163 -0.1262 -0.0714 -0.0759 -0.1167 0.2788 -0.2593 -0.2481 -0.1199 -0.0992 -0.2514 0.1056 0.0923 0.0868 0.1058 0.0704 0.0630 0.0718 0.0605 0.0827 0.0888 0.0724 0.0884 0.0723 0.0951 0.1070 0.1134 0.0638 0.0591 0.0909 0.0856 0.0722
va: 2.3286 2.0896 3.1091 3.8935 3.8664 3.8104 3.8706 4.2704 3.9650 3.9318 3.8976 3.9062 3.9336 1.0155 0.9994 1.0053 1.0294 1.0327 1.0112 1.0152 1.0038 1.0038 1.0053 1.0031 1.0051 1.0068 1.0070 1.0098 1.0387 1.0107 1.0120 1.0069 1.0063 1.0137
dispcorr: -0.014648823 hartree
energy: -921.992314804181
dipole: 7.14000 -6.45748 0.68252 -0.19780 -0.22189 -0.41970 1.06928 -0.87264 0.19664
magnitude: 0.82502 au
magnitude: 2.09702 debye
