program: Orca
programVersion: 5.0.2
elementType: S O N C C C C C C C C C C H H H H H H H H H H H H H H H H H H H H H
charge: 0
multiplicity: 1
keywords: wb97x-d3
keywords: def2-TZVPP
keywords: def2/J RIJCOSX
keywords: DEFGRID2
keywords: scfconv7
keywords: smallprint printgap noloewdin
keywords: NOSOSCF
formula: C10H21NOS
InChI: InChI=1/C10H21NOS/c1-4-7-11(8-5-2)10(12)13-9-6-3/h4-9H2,1-3H3
34 atoms
S  -1.019299 -1.192131 0.112025
O  -0.695476 1.096482 1.384236
N  1.122024 0.376841 0.230635
C  1.765994 -0.630123 -0.58913
C  1.937015 1.504163 0.655807
C  2.400732 -1.763459 0.209846
C  2.095672 2.576176 -0.418124
C  -0.155115 0.283243 0.671369
C  3.079626 -2.777804 -0.697638
C  0.778307 3.182164 -0.877064
C  -2.657385 -0.861667 0.813531
C  -3.506928 0.093042 -0.010899
C  -3.849496 -0.435493 -1.394526
H  2.532131 -0.127395 -1.185005
H  1.054165 -1.031566 -1.314577
H  2.920542 1.122724 0.945234
H  1.490565 1.936721 1.549356
H  3.127573 -1.34874 0.91384
H  1.632877 -2.255502 0.810332
H  2.742737 3.356674 -0.008543
H  2.634317 2.167283 -1.278512
H  3.868871 -2.3177 -1.294882
H  3.533641 -3.582366 -0.120297
H  2.366672 -3.231939 -1.387442
H  0.215615 3.593727 -0.039495
H  0.950072 3.984153 -1.595024
H  0.144907 2.439639 -1.362332
H  -2.522333 -0.494944 1.829746
H  -3.129828 -1.844588 0.876155
H  -4.428546 0.279048 0.548815
H  -2.9976 1.054835 -0.082421
H  -2.950522 -0.620658 -1.982968
H  -4.406352 -1.372565 -1.33577
H  -4.463304 0.277298 -1.944918
totalener: -921.97938557 hartree
nucrepener: 985.48957894 hartree
electener: -1907.46896451 hartree
oneelecener: -3216.67474909 hartree
twoeener: 1309.20578458 hartree
kineticenergy: 918.78397130 hartree
xcener: -71.980082079020 hartree
chargesum: 0.0000000
charge: -0.127631 -0.416804 -0.125615 -0.127100 -0.067921 -0.058749 -0.104863 0.276811 -0.256790 -0.243728 -0.112543 -0.115038 -0.239288 0.096792 0.100807 0.090486 0.105687 0.055802 0.065352 0.065739 0.050257 0.072479 0.088448 0.081095 0.092956 0.087496 0.070607 0.118322 0.105988 0.063227 0.079670 0.074899 0.068690 0.084459
qa: -0.1276 -0.4168 -0.1256 -0.1271 -0.0679 -0.0587 -0.1049 0.2768 -0.2568 -0.2437 -0.1125 -0.1150 -0.2393 0.0968 0.1008 0.0905 0.1057 0.0558 0.0654 0.0657 0.0503 0.0725 0.0884 0.0811 0.0930 0.0875 0.0706 0.1183 0.1060 0.0632 0.0797 0.0749 0.0687 0.0845
va: 2.3330 2.0859 3.1120 3.9183 3.8676 3.8288 3.8908 4.2837 3.9458 3.9290 3.9145 3.8916 3.9225 0.9969 1.0162 1.0012 1.0250 1.0147 1.0329 1.0148 1.0100 1.0036 1.0056 1.0034 1.0078 1.0056 1.0084 1.0322 1.0082 1.0108 1.0182 1.0187 1.0039 1.0067
dispcorr: -0.013999154 hartree
energy: -921.993384724820
dipole: 4.17711 -3.52214 0.65497 1.85064 -2.11946 -0.26882 -7.15245 6.71689 -0.43556
magnitude: 0.83124 au
magnitude: 2.11286 debye
