program: Orca
programVersion: 5.0.2
elementType: S O N C C C C C C C C C C H H H H H H H H H H H H H H H H H H H H H
charge: 0
multiplicity: 1
keywords: wb97x-d3
keywords: def2-TZVPP
keywords: def2/J RIJCOSX
keywords: DEFGRID2
keywords: scfconv7
keywords: smallprint printgap noloewdin
keywords: NOSOSCF
formula: C10H21NOS
InChI: InChI=1/C10H21NOS/c1-4-7-11(8-5-2)10(12)13-9-6-3/h4-9H2,1-3H3
34 atoms
S  -1.173926 -0.896729 -0.868308
O  -1.001856 1.486158 0.260011
N  0.974249 0.41916 -0.017798
C  1.737089 -0.71802 -0.493036
C  1.705545 1.506414 0.611684
C  1.908859 -1.816948 0.549551
C  2.131429 2.590288 -0.370417
C  -0.369959 0.52697 -0.118227
C  2.722779 -2.984023 0.012099
C  2.922281 3.694787 0.315662
C  -2.901359 -0.353774 -0.767091
C  -3.549386 -0.589172 0.588512
C  -3.641354 -2.056408 0.976439
H  2.717133 -0.348742 -0.808008
H  1.279587 -1.124849 -1.398155
H  2.584852 1.076325 1.100063
H  1.091754 1.940131 1.401239
H  2.393546 -1.401312 1.437475
H  0.922932 -2.163357 0.86687
H  2.730455 2.146419 -1.170836
H  1.240295 3.007775 -0.842491
H  3.721293 -2.669741 -0.296973
H  2.84342 -3.761475 0.765581
H  2.238899 -3.440111 -0.853047
H  2.327698 4.18666 1.086621
H  3.824231 3.307129 0.792716
H  3.232147 4.459472 -0.395718
H  -3.413295 -0.923742 -1.546022
H  -2.941519 0.697747 -1.047687
H  -3.006511 -0.024941 1.34756
H  -4.553811 -0.156913 0.549695
H  -2.652933 -2.511146 1.0469
H  -4.12982 -2.176464 1.943507
H  -4.216993 -2.62626 0.244555
totalener: -921.98030410 hartree
nucrepener: 969.59990647 hartree
electener: -1891.58021057 hartree
oneelecener: -3184.85901641 hartree
twoeener: 1293.27880584 hartree
kineticenergy: 918.77875449 hartree
xcener: -71.977416484508 hartree
chargesum: 0.0000000
charge: -0.131760 -0.423758 -0.130089 -0.123403 -0.061139 -0.055231 -0.075482 0.282935 -0.256489 -0.256174 -0.110335 -0.117359 -0.240461 0.095964 0.100617 0.085775 0.098163 0.055725 0.061164 0.047964 0.076435 0.072301 0.087813 0.080856 0.082500 0.069211 0.086554 0.106515 0.117827 0.081325 0.063160 0.075240 0.084706 0.068929
qa: -0.1318 -0.4238 -0.1301 -0.1234 -0.0611 -0.0552 -0.0755 0.2829 -0.2565 -0.2562 -0.1103 -0.1174 -0.2405 0.0960 0.1006 0.0858 0.0982 0.0557 0.0612 0.0480 0.0764 0.0723 0.0878 0.0809 0.0825 0.0692 0.0866 0.1065 0.1178 0.0813 0.0632 0.0752 0.0847 0.0689
va: 2.3238 2.0805 3.1488 3.9250 3.8649 3.8362 3.8648 4.2836 3.9442 3.9453 3.9116 3.8901 3.9279 0.9960 1.0121 0.9963 1.0235 1.0150 1.0291 1.0147 1.0191 1.0036 1.0057 1.0037 1.0029 1.0037 1.0055 1.0080 1.0324 1.0193 1.0101 1.0155 1.0067 1.0037
dispcorr: -0.013150881 hartree
energy: -921.993454975725
dipole: 7.71971 -7.00083 0.71887 -1.91192 1.48615 -0.42577 4.37832 -4.42933 -0.05100
magnitude: 0.83706 au
magnitude: 2.12763 debye
