program: Orca
programVersion: 5.0.2
elementType: S O N C C C C C C C C C C H H H H H H H H H H H H H H H H H H H H H
charge: 0
multiplicity: 1
keywords: wb97x-d3
keywords: def2-TZVPP
keywords: def2/J RIJCOSX
keywords: DEFGRID2
keywords: scfconv7
keywords: smallprint printgap noloewdin
keywords: NOSOSCF
formula: C10H21NOS
InChI: InChI=1/C10H21NOS/c1-4-7-11(8-5-2)10(12)13-9-6-3/h4-9H2,1-3H3
34 atoms
S  -1.198336 -0.867439 0.403579
O  -0.76945 1.724875 0.588694
N  1.104167 0.451514 0.612808
C  1.726379 -0.850584 0.475429
C  1.941882 1.637155 0.708502
C  1.955663 -1.303752 -0.963585
C  2.210621 2.335575 -0.620436
C  -0.236166 0.640981 0.545223
C  2.507647 -2.720165 -1.020036
C  3.046997 3.59214 -0.426985
C  -2.868167 -0.156228 0.381505
C  -3.891627 -1.265208 0.176733
C  -3.79251 -1.962426 -1.172987
H  1.128396 -1.596923 1.00654
H  2.680663 -0.816221 1.006657
H  2.886889 1.332552 1.165249
H  1.473822 2.341342 1.398247
H  1.012367 -1.250284 -1.511018
H  2.644415 -0.615429 -1.459308
H  2.722178 1.652603 -1.3034
H  1.258492 2.592964 -1.087337
H  2.684852 -3.034612 -2.047848
H  3.454667 -2.804803 -0.483753
H  1.812103 -3.433205 -0.574395
H  4.013756 3.366804 0.027612
H  3.240989 4.088325 -1.37756
H  2.538556 4.309521 0.219119
H  -2.927707 0.581236 -0.418648
H  -3.040336 0.360383 1.324563
H  -3.813368 -1.996564 0.9853
H  -4.880598 -0.810678 0.278061
H  -2.844218 -2.486387 -1.292306
H  -4.590555 -2.695025 -1.291702
H  -3.875743 -1.246309 -1.991811
totalener: -921.97726804 hartree
nucrepener: 966.65111582 hartree
electener: -1888.62838386 hartree
oneelecener: -3178.93808536 hartree
twoeener: 1290.30970150 hartree
kineticenergy: 918.77642255 hartree
xcener: -71.977198742756 hartree
chargesum: 0.0000000
charge: -0.132912 -0.414787 -0.136516 -0.109700 -0.050155 -0.077861 -0.089242 0.288856 -0.258099 -0.258035 -0.100669 -0.120993 -0.237105 0.100212 0.088207 0.079425 0.098388 0.068126 0.063480 0.053476 0.080832 0.087945 0.073000 0.082532 0.069521 0.086277 0.084003 0.095027 0.109977 0.067589 0.072624 0.078800 0.084304 0.073475
qa: -0.1329 -0.4148 -0.1365 -0.1097 -0.0502 -0.0779 -0.0892 0.2889 -0.2581 -0.2580 -0.1007 -0.1210 -0.2371 0.1002 0.0882 0.0794 0.0984 0.0681 0.0635 0.0535 0.0808 0.0879 0.0730 0.0825 0.0695 0.0863 0.0840 0.0950 0.1100 0.0676 0.0726 0.0788 0.0843 0.0735
va: 2.3563 2.0961 3.1716 3.9221 3.8700 3.8124 3.8489 4.2914 3.9564 3.9565 3.9638 3.9082 3.9333 1.0093 1.0050 1.0052 1.0178 1.0317 1.0140 1.0128 1.0209 1.0055 1.0029 1.0046 1.0028 1.0051 1.0037 1.0186 1.0162 1.0133 1.0062 1.0103 1.0060 1.0049
dispcorr: -0.012992615 hartree
energy: -921.990260659570
dipole: 6.79037 -6.22955 0.56082 -2.29379 1.72487 -0.56892 -7.01006 6.83804 -0.17202
magnitude: 0.81718 au
magnitude: 2.07710 debye
