program: Orca
programVersion: 5.0.2
elementType: S O N C C C C C C C C C C H H H H H H H H H H H H H H H H H H H H H
charge: 0
multiplicity: 1
keywords: wb97x-d3
keywords: def2-TZVPP
keywords: def2/J RIJCOSX
keywords: DEFGRID2
keywords: scfconv7
keywords: smallprint printgap noloewdin
keywords: NOSOSCF
formula: C10H21NOS
InChI: InChI=1/C10H21NOS/c1-4-7-11(8-5-2)10(12)13-9-6-3/h4-9H2,1-3H3
34 atoms
S  -1.040397 -0.899018 0.177239
O  -0.762324 1.669294 0.663764
N  1.169443 0.471516 0.731295
C  1.85106 -0.796029 0.550787
C  1.963354 1.629045 1.114325
C  2.183795 -1.155117 -0.895024
C  2.81857 2.210999 -0.007115
C  -0.167473 0.622437 0.561746
C  2.84736 -2.520926 -0.986703
C  2.013968 2.662128 -1.216234
C  -2.732306 -0.256779 0.07196
C  -3.673098 -1.407859 -0.253857
C  -5.116942 -0.935475 -0.351193
H  1.261927 -1.599848 1.003555
H  2.774098 -0.750934 1.134517
H  2.606175 1.333942 1.948911
H  1.285962 2.393146 1.49076
H  1.269517 -1.148497 -1.491578
H  2.838972 -0.392121 -1.321009
H  3.36595 3.059951 0.41194
H  3.582853 1.489862 -0.311355
H  2.192109 -3.305944 -0.605846
H  3.093087 -2.772296 -2.017769
H  3.774464 -2.55799 -0.411472
H  2.657979 3.128614 -1.961893
H  1.510244 1.823578 -1.697547
H  1.246563 3.383311 -0.935159
H  -2.775214 0.512996 -0.698253
H  -2.998564 0.207119 1.021409
H  -3.37352 -1.874274 -1.195461
H  -3.589927 -2.180711 0.514195
H  -5.237969 -0.184116 -1.132424
H  -5.785635 -1.763772 -0.583999
H  -5.454159 -0.492654 0.586899
totalener: -921.97747284 hartree
nucrepener: 971.51071062 hartree
electener: -1893.48818346 hartree
oneelecener: -3188.65613216 hartree
twoeener: 1295.16794871 hartree
kineticenergy: 918.78001932 hartree
xcener: -71.978950046766 hartree
chargesum: -0.0000000
charge: -0.120918 -0.411251 -0.120458 -0.120887 -0.071507 -0.075339 -0.116506 0.279840 -0.260848 -0.246565 -0.104809 -0.089739 -0.259134 0.105157 0.091976 0.086917 0.105024 0.069102 0.062037 0.072009 0.059043 0.082568 0.088336 0.072688 0.088386 0.070596 0.095729 0.095172 0.097047 0.067705 0.068202 0.077001 0.086152 0.077277
qa: -0.1209 -0.4113 -0.1205 -0.1209 -0.0715 -0.0753 -0.1165 0.2798 -0.2608 -0.2466 -0.1048 -0.0897 -0.2591 0.1052 0.0920 0.0869 0.1050 0.0691 0.0620 0.0720 0.0590 0.0826 0.0883 0.0727 0.0884 0.0706 0.0957 0.0952 0.0970 0.0677 0.0682 0.0770 0.0862 0.0773
va: 2.3646 2.0967 3.1161 3.8939 3.8719 3.8132 3.8660 4.2914 3.9657 3.9301 3.9894 3.8677 3.9599 1.0105 1.0000 1.0052 1.0283 1.0337 1.0105 1.0152 1.0040 1.0040 1.0051 1.0031 1.0051 1.0065 1.0081 1.0166 1.0159 1.0115 1.0112 1.0032 1.0057 1.0034
dispcorr: -0.013716079 hartree
energy: -921.991188918664
dipole: 4.10567 -3.50285 0.60282 -1.86349 1.32954 -0.53396 -6.17522 6.07479 -0.10043
magnitude: 0.81153 au
magnitude: 2.06276 debye
