program: Orca
programVersion: 5.0.2
elementType: S O N C C C C C C C C C C H H H H H H H H H H H H H H H H H H H H H
charge: 0
multiplicity: 1
keywords: wb97x-d3
keywords: def2-TZVPP
keywords: def2/J RIJCOSX
keywords: DEFGRID2
keywords: scfconv7
keywords: smallprint printgap noloewdin
keywords: NOSOSCF
formula: C10H21NOS
InChI: InChI=1/C10H21NOS/c1-4-7-11(8-5-2)10(12)13-9-6-3/h4-9H2,1-3H3
34 atoms
S  -1.055272 -1.361574 0.961546
O  -0.96206 1.271669 0.731957
N  1.052902 0.256471 0.689839
C  1.88658 -0.92957 0.724172
C  1.718445 1.544086 0.54824
C  2.495085 -1.306335 -0.623525
C  1.673696 2.137169 -0.855723
C  -0.298495 0.261452 0.768909
C  1.466025 -1.590248 -1.70633
C  2.428424 3.45689 -0.921701
C  -2.813184 -0.920497 0.923077
C  -3.468902 -1.161566 -0.4298
C  -2.904178 -0.315544 -1.559176
H  1.313745 -1.77085 1.114324
H  2.68643 -0.758181 1.450515
H  2.758688 1.400516 0.851973
H  1.281744 2.252674 1.254829
H  3.177662 -0.517653 -0.952741
H  3.120003 -2.189137 -0.463766
H  2.102048 1.431036 -1.571009
H  0.634005 2.289658 -1.147893
H  1.952319 -1.865665 -2.642038
H  0.800605 -2.40505 -1.421213
H  0.842615 -0.717911 -1.905438
H  2.390176 3.884087 -1.923189
H  2.003339 4.191795 -0.236418
H  3.480643 3.331966 -0.659162
H  -2.901259 0.121245 1.23093
H  -3.283581 -1.534896 1.6917
H  -3.393804 -2.221047 -0.687167
H  -4.536864 -0.952862 -0.313891
H  -1.856688 -0.555014 -1.745336
H  -3.450731 -0.494387 -2.485144
H  -2.96495 0.747764 -1.329707
totalener: -921.97766960 hartree
nucrepener: 999.78841662 hartree
electener: -1921.76608622 hartree
oneelecener: -3245.28166986 hartree
twoeener: 1323.51558364 hartree
kineticenergy: 918.78000150 hartree
xcener: -71.980707415219 hartree
chargesum: 0.0000000
charge: -0.130209 -0.417223 -0.127619 -0.107433 -0.068516 -0.090242 -0.085660 0.275449 -0.260787 -0.259091 -0.115877 -0.100357 -0.240280 0.104289 0.091852 0.083572 0.102637 0.063412 0.071481 0.050669 0.086855 0.094901 0.089692 0.065233 0.087003 0.082810 0.069896 0.112353 0.108755 0.059157 0.063204 0.062636 0.086123 0.091317
qa: -0.1302 -0.4172 -0.1276 -0.1074 -0.0685 -0.0902 -0.0857 0.2754 -0.2608 -0.2591 -0.1159 -0.1004 -0.2403 0.1043 0.0919 0.0836 0.1026 0.0634 0.0715 0.0507 0.0869 0.0949 0.0897 0.0652 0.0870 0.0828 0.0699 0.1124 0.1088 0.0592 0.0632 0.0626 0.0861 0.0913
va: 2.3277 2.0860 3.1238 3.9272 3.8701 3.8252 3.8354 4.2820 3.9441 3.9649 3.8969 3.9084 3.9377 1.0138 1.0064 1.0005 1.0170 1.0025 1.0168 1.0097 1.0199 1.0091 1.0073 1.0057 1.0050 1.0031 1.0027 1.0379 1.0097 1.0120 1.0108 1.0096 1.0077 1.0083
dispcorr: -0.015439067 hartree
energy: -921.993108670252
dipole: 5.99568 -5.29226 0.70342 3.68436 -4.09357 -0.40921 -11.41965 11.23012 -0.18953
magnitude: 0.83557 au
magnitude: 2.12386 debye
