program: Orca
programVersion: 5.0.2
elementType: Cl Cl Cl Cl Cl O C C C C C C C C C C H H H H H H H
charge: 0
multiplicity: 1
keywords: wb97x-d3
keywords: def2-TZVPP
keywords: def2/J RIJCOSX
keywords: DEFGRID2
keywords: scfconv7
keywords: smallprint printgap noloewdin
keywords: NOSOSCF
formula: C10H7Cl5O
InChI: InChI=1/C10H7Cl5O/c11-7-1-6(2-8(12)3-7)9(5-16-9)4-10(13,14)15/h1-3H,4-5H2
23 atoms
Cl 3.998544 0.266236 -0.838925
Cl 1.245332 0.614399 -1.570409
Cl 2.168918 -1.954174 -0.65068
Cl -3.457498 -1.880991 -0.950393
Cl -2.683064 3.276749 0.303326
O  0.864468 -1.642816 2.148193
C  0.775064 -0.343343 1.620907
C  0.771428 -0.579787 3.068857
C  2.052699 0.191525 1.003819
C  -0.525615 -0.002006 0.968059
C  2.330311 -0.208179 -0.440638
C  -0.952464 1.319439 0.947426
C  -1.297816 -0.997802 0.391195
C  -2.491877 -0.651478 -0.221236
C  -2.148339 1.636093 0.330216
C  -2.932462 0.660047 -0.265137
H  1.663637 -0.374249 3.656542
H  -0.1656 -0.494487 3.612538
H  2.893358 -0.168685 1.600077
H  2.070493 1.282513 1.050586
H  -0.359697 2.100064 1.406162
H  -0.972021 -2.027793 0.412848
H  -3.865222 0.915863 -0.74652
totalener: -2761.55278966 hartree
nucrepener: 1756.93396356 hartree
electener: -4518.48675322 hartree
oneelecener: -7301.06118282 hartree
twoeener: 2782.57442960 hartree
kineticenergy: 2756.38428722 hartree
xcener: -150.273909882453 hartree
chargesum: 0.0000000
charge: -0.052165 -0.037677 -0.032855 -0.060052 -0.062989 -0.336450 0.233265 0.060719 -0.230304 -0.064622 0.148419 -0.183828 -0.095710 0.063253 0.093368 -0.147160 0.060840 0.069923 0.115642 0.115383 0.103063 0.122786 0.117149
qa: -0.0522 -0.0377 -0.0329 -0.0601 -0.0630 -0.3365 0.2333 0.0607 -0.2303 -0.0646 0.1484 -0.1838 -0.0957 0.0633 0.0934 -0.1472 0.0608 0.0699 0.1156 0.1154 0.1031 0.1228 0.1171
va: 1.2425 1.2567 1.2707 1.2446 1.2422 2.0198 3.7323 4.0044 3.9131 3.5618 4.4769 4.0449 4.0007 3.9906 3.9484 4.0469 1.0010 1.0045 1.0319 1.0220 1.0285 1.0395 1.0206
dispcorr: -0.014017975 hartree
energy: -2761.566807635586
dipole: -0.50520 0.81666 0.31146 0.69967 -0.15677 0.54291 15.32128 -14.30893 1.01235
magnitude: 1.19021 au
magnitude: 3.02529 debye
