program: Orca
programVersion: 5.0.2
elementType: Cl Cl Cl S O N C C C C C C C C C C H H H H H H H H H H H H H H H H
charge: 0
multiplicity: 1
keywords: wb97x-d3
keywords: def2-TZVPP
keywords: def2/J RIJCOSX
keywords: DEFGRID2
keywords: scfconv7
keywords: smallprint printgap noloewdin
keywords: NOSOSCF
formula: C10H16Cl3NOS
InChI: InChI=1/C10H16Cl3NOS/c1-6(2)14(7(3)4)10(15)16-5-8(11)9(12)13/h6-7H,5H2,1-4H3
32 atoms
Cl -2.755416 1.930759 0.648688
Cl -4.629413 -0.015613 -0.92147
Cl -2.702473 -2.137789 -0.644446
S  0.26606 0.32146 -0.281794
O  1.627574 -0.4154 1.833878
N  2.911221 0.106331 0.033649
C  3.011949 0.522543 -1.370901
C  4.177562 -0.172691 0.738574
C  3.615129 -0.575466 -2.236459
C  3.749987 1.846126 -1.513589
C  4.32572 -1.632776 1.146765
C  4.446478 0.793255 1.885072
C  1.74866 -0.049384 0.676095
C  -0.993215 -0.114794 0.961547
C  -2.31423 0.285465 0.402291
C  -3.120999 -0.513606 -0.295969
H  2.001553 0.689976 -1.744354
H  4.950913 0.014892 -0.005382
H  4.650187 -0.794457 -1.97111
H  3.038038 -1.497275 -2.163071
H  3.607572 -0.260033 -3.279923
H  3.26913 2.632845 -0.932418
H  3.741622 2.153056 -2.559548
H  4.793547 1.778068 -1.203662
H  4.126609 -2.297908 0.305768
H  5.352609 -1.809785 1.469045
H  3.67077 -1.913661 1.968862
H  3.783203 0.641054 2.734253
H  4.352619 1.828903 1.5567
H  5.469097 0.652293 2.23703
H  -0.806212 0.421907 1.889424
H  -0.960424 -1.181814 1.169365
elementType: Cl S O N C H
totalener: -2299.56862638 hartree
nucrepener: 1660.73872310 hartree
electener: -3960.30734948 hartree
oneelecener: -6468.52104179 hartree
twoeener: 2508.21369230 hartree
cpcmener: -0.01902087 hartree
kineticenergy: 2294.54432571 hartree
xcener: -134.005094134960 hartree
chargesum: 0.0000000
charge: -0.057904 -0.023963 -0.026143 -0.115373 -0.537928 -0.081764 0.032003 0.064420 -0.267382 -0.268111 -0.285371 -0.284110 0.339469 -0.064998 -0.029901 0.032013 0.081355 0.085156 0.092597 0.096385 0.102273 0.096594 0.102316 0.092523 0.098697 0.102247 0.092354 0.092324 0.098434 0.102109 0.119197 0.120478
qa: -0.0579 -0.0240 -0.0261 -0.1154 -0.5379 -0.0818 0.0320 0.0644 -0.2674 -0.2681 -0.2854 -0.2841 0.3395 -0.0650 -0.0299 0.0320 0.0814 0.0852 0.0926 0.0964 0.1023 0.0966 0.1023 0.0925 0.0987 0.1022 0.0924 0.0923 0.0984 0.1021 0.1192 0.1205
va: 1.2671 1.3006 1.2955 2.3648 1.9628 3.1727 3.9475 3.8494 3.9164 3.9147 3.9060 3.9095 4.2297 3.9485 3.9349 4.2167 1.0026 0.9943 1.0020 1.0096 1.0060 1.0096 1.0057 1.0022 1.0020 1.0024 1.0184 1.0177 1.0026 1.0024 1.0280 1.0234
dispcorr: -0.015891781 hartree
energy: -2299.584518165038
dipole: 65.31153 -63.55951 1.75202 1.16887 -1.04629 0.12258 1.04222 -2.14995 -1.10774
magnitude: 2.07646 au
magnitude: 5.27793 debye
