program: Orca
programVersion: 5.0.2
elementType: Cl Cl Cl S O N C C C C C C C C C C H H H H H H H H H H H H H H H H
charge: 0
multiplicity: 1
keywords: wb97x-d3
keywords: def2-TZVPP
keywords: def2/J RIJCOSX
keywords: DEFGRID2
keywords: scfconv7
keywords: smallprint printgap noloewdin
keywords: NOSOSCF
formula: C10H16Cl3NOS
InChI: InChI=1/C10H16Cl3NOS/c1-6(2)14(7(3)4)10(15)16-5-8(11)9(12)13/h6-7H,5H2,1-4H3
32 atoms
Cl -2.532361 -1.353447 1.564403
Cl -3.260093 1.669523 1.440212
Cl -2.361138 1.799646 -1.292452
S  -0.021107 -0.511903 -1.624151
O  0.55534 -1.369797 0.779576
N  2.293344 -0.384401 -0.300832
C  2.830166 0.247284 -1.512677
C  3.173604 -0.4159 0.883455
C  4.088642 -0.456338 -2.00331
C  3.036927 1.742237 -1.31821
C  3.566432 -1.82636 1.29954
C  2.641793 0.417639 2.043155
C  1.029974 -0.814947 -0.195863
C  -1.582105 -1.183456 -0.995487
C  -2.196363 -0.43492 0.149106
C  -2.561311 0.846301 0.114584
H  2.093302 0.122244 -2.30657
H  4.089141 0.075607 0.556197
H  4.925323 -0.35722 -1.311074
H  3.908555 -1.517074 -2.176565
H  4.398135 -0.012682 -2.949647
H  3.366014 2.193056 -2.254704
H  3.797718 1.957757 -0.566452
H  2.10983 2.232115 -1.019377
H  3.962796 -2.389998 0.454519
H  4.351157 -1.771251 2.054948
H  2.737328 -2.387101 1.726724
H  3.424884 0.518927 2.795468
H  1.776586 -0.028133 2.529415
H  2.371988 1.42171 1.713856
H  -1.449763 -2.230552 -0.734623
H  -2.250367 -1.156398 -1.859533
elementType: Cl S O N C H
totalener: -2299.56563906 hartree
nucrepener: 1730.80277811 hartree
electener: -4030.36841717 hartree
oneelecener: -6609.44270950 hartree
twoeener: 2579.07429233 hartree
cpcmener: -0.02050907 hartree
kineticenergy: 2294.56482086 hartree
xcener: -134.010199305750 hartree
chargesum: 0.0000000
charge: -0.060934 -0.033989 -0.029436 -0.112615 -0.526236 -0.087199 0.041427 0.067135 -0.269556 -0.268999 -0.283355 -0.288400 0.323075 -0.090662 0.011382 0.002418 0.077670 0.085281 0.092745 0.096192 0.102933 0.102773 0.093047 0.092597 0.097554 0.101478 0.090921 0.102618 0.090928 0.099373 0.117374 0.162458
qa: -0.0609 -0.0340 -0.0294 -0.1126 -0.5262 -0.0872 0.0414 0.0671 -0.2696 -0.2690 -0.2834 -0.2884 0.3231 -0.0907 0.0114 0.0024 0.0777 0.0853 0.0927 0.0962 0.1029 0.1028 0.0930 0.0926 0.0976 0.1015 0.0909 0.1026 0.0909 0.0994 0.1174 0.1625
va: 1.2620 1.2899 1.2993 2.3451 1.9780 3.1530 3.9335 3.8469 3.9095 3.9222 3.9108 3.9065 4.2437 3.9023 3.8582 4.2237 1.0074 0.9945 1.0025 1.0099 1.0049 1.0066 1.0015 1.0108 1.0030 1.0026 1.0178 1.0027 1.0197 1.0016 1.0435 0.9957
dispcorr: -0.017160587 hartree
energy: -2299.582799643057
dipole: 53.18893 -51.42353 1.76540 -6.16427 6.58205 0.41778 -5.20406 3.82496 -1.37910
magnitude: 2.27884 au
magnitude: 5.79235 debye
