program: Orca
programVersion: 5.0.2
elementType: Cl Cl Cl S O N C C C C C C C C C C H H H H H H H H H H H H H H H H
charge: 0
multiplicity: 1
keywords: wb97x-d3
keywords: def2-TZVPP
keywords: def2/J RIJCOSX
keywords: DEFGRID2
keywords: scfconv7
keywords: smallprint printgap noloewdin
keywords: NOSOSCF
formula: C10H16Cl3NOS
InChI: InChI=1/C10H16Cl3NOS/c1-6(2)14(7(3)4)10(15)16-5-8(11)9(12)13/h6-7H,5H2,1-4H3
32 atoms
Cl -2.744799 -1.486152 0.981811
Cl -3.430627 1.435668 1.823686
Cl -2.422408 2.417214 -0.690298
S  -0.085595 0.246523 -1.65901
O  0.36228 -1.537833 0.205106
N  2.210873 -0.398627 -0.460556
C  2.824978 0.605845 -1.339492
C  3.057652 -0.957232 0.611941
C  4.055619 0.057734 -2.049028
C  3.115748 1.898351 -0.591071
C  3.300861 -2.452304 0.461824
C  2.585059 -0.573873 2.008901
C  0.906893 -0.701177 -0.493776
C  -1.70874 -0.502916 -1.360201
C  -2.346381 -0.165183 -0.046618
C  -2.687889 1.067167 0.328634
H  2.108977 0.834604 -2.129494
H  4.023099 -0.471087 0.478132
H  3.82621 -0.856242 -2.596484
H  4.407904 0.796591 -2.76895
H  4.881889 -0.14589 -1.367276
H  3.856855 1.756871 0.197114
H  2.209848 2.305419 -0.140834
H  3.510422 2.644659 -1.281257
H  2.408111 -3.04471 0.654715
H  3.664794 -2.69359 -0.53732
H  4.064866 -2.765101 1.174769
H  1.682374 -1.099158 2.314334
H  2.400968 0.498638 2.081915
H  3.367879 -0.821417 2.726736
H  -1.641633 -1.580179 -1.487458
H  -2.328517 -0.127396 -2.177458
elementType: Cl S O N C H
totalener: -2299.56612629 hartree
nucrepener: 1722.42675659 hartree
electener: -4021.99288288 hartree
oneelecener: -6592.65250346 hartree
twoeener: 2570.65962057 hartree
cpcmener: -0.02047132 hartree
kineticenergy: 2294.55466052 hartree
xcener: -134.008082365295 hartree
chargesum: 0.0000000
charge: -0.059107 -0.033142 -0.029770 -0.112901 -0.525793 -0.091369 0.048711 0.069804 -0.270593 -0.272988 -0.282517 -0.290210 0.321455 -0.084651 0.000106 0.007512 0.077193 0.085516 0.095509 0.102985 0.093421 0.093942 0.092375 0.102559 0.090741 0.096552 0.100691 0.091323 0.099561 0.103595 0.118038 0.161455
qa: -0.0591 -0.0331 -0.0298 -0.1129 -0.5258 -0.0914 0.0487 0.0698 -0.2706 -0.2730 -0.2825 -0.2902 0.3215 -0.0847 0.0001 0.0075 0.0772 0.0855 0.0955 0.1030 0.0934 0.0939 0.0924 0.1026 0.0907 0.0966 0.1007 0.0913 0.0996 0.1036 0.1180 0.1615
va: 1.2636 1.2910 1.2993 2.3455 1.9779 3.1535 3.9235 3.8440 3.9089 3.9245 3.9114 3.9063 4.2488 3.8937 3.8633 4.2221 1.0083 0.9947 1.0103 1.0044 1.0031 1.0006 1.0106 1.0069 1.0180 1.0036 1.0027 1.0193 1.0014 1.0024 1.0443 0.9969
dispcorr: -0.016977245 hartree
energy: -2299.583103536743
dipole: 53.92441 -52.07046 1.85395 -8.98301 9.69222 0.70921 -6.77547 5.64408 -1.13139
magnitude: 2.28476 au
magnitude: 5.80740 debye
