program: Orca
programVersion: 5.0.2
elementType: Cl Cl Cl S O N C C C C C C C C C C H H H H H H H H H H H H H H H H
charge: 0
multiplicity: 1
keywords: wb97x-d3
keywords: def2-TZVPP
keywords: def2/J RIJCOSX
keywords: DEFGRID2
keywords: scfconv7
keywords: smallprint printgap noloewdin
keywords: NOSOSCF
formula: C10H16Cl3NOS
InChI: InChI=1/C10H16Cl3NOS/c1-6(2)14(7(3)4)10(15)16-5-8(11)9(12)13/h6-7H,5H2,1-4H3
32 atoms
Cl -2.4588 0.642082 -1.583931
Cl -3.481934 -1.83273 -0.010611
Cl -2.324185 -0.838772 2.42253
S  0.233097 1.917612 -0.169864
O  0.630586 -0.369265 1.046559
N  2.336804 0.273397 -0.307582
C  2.922492 1.261228 -1.223169
C  3.115044 -0.957006 -0.064376
C  3.042857 0.711969 -2.637687
C  4.243841 1.801956 -0.694401
C  2.41946 -2.211897 -0.576874
C  3.593962 -1.088876 1.375473
C  1.138535 0.420209 0.27017
C  -1.325748 1.588049 0.690694
C  -2.11016 0.470657 0.093967
C  -2.57081 -0.596604 0.745561
H  2.243767 2.112514 -1.275201
H  4.010995 -0.838815 -0.673052
H  3.416562 1.492163 -3.301199
H  3.736872 -0.127576 -2.70003
H  2.074422 0.387246 -3.018107
H  4.604177 2.586284 -1.360455
H  5.020175 1.037257 -0.645841
H  4.125342 2.236742 0.297845
H  3.12041 -3.046714 -0.539256
H  1.547978 -2.489241 0.011768
H  2.109442 -2.091885 -1.61548
H  2.788683 -1.305568 2.074209
H  4.101299 -0.181872 1.705278
H  4.312403 -1.907435 1.437377
H  -1.887618 2.519495 0.584693
H  -1.148371 1.439378 1.752249
elementType: Cl S O N C H
totalener: -2299.56878419 hartree
nucrepener: 1726.98374497 hartree
electener: -4026.55252916 hartree
oneelecener: -6601.96466031 hartree
twoeener: 2575.41213116 hartree
cpcmener: -0.01987828 hartree
kineticenergy: 2294.55607289 hartree
xcener: -134.008761894719 hartree
chargesum: 0.0000000
charge: -0.064517 -0.035461 -0.031345 -0.120144 -0.526342 -0.084397 0.035249 0.066525 -0.267324 -0.269299 -0.286727 -0.283946 0.324206 -0.066270 -0.017123 0.026337 0.079639 0.083722 0.102487 0.092651 0.094801 0.102837 0.092179 0.096873 0.102473 0.091366 0.099208 0.090917 0.098194 0.101652 0.153961 0.117617
qa: -0.0645 -0.0355 -0.0313 -0.1201 -0.5263 -0.0844 0.0352 0.0665 -0.2673 -0.2693 -0.2867 -0.2839 0.3242 -0.0663 -0.0171 0.0263 0.0796 0.0837 0.1025 0.0927 0.0948 0.1028 0.0922 0.0969 0.1025 0.0914 0.0992 0.0909 0.0982 0.1017 0.1540 0.1176
va: 1.2687 1.2889 1.2892 2.3406 1.9794 3.1559 3.9428 3.8467 3.9173 3.9127 3.9086 3.9101 4.2384 3.8944 3.8893 4.2081 1.0052 0.9948 1.0061 1.0022 1.0102 1.0056 1.0021 1.0093 1.0025 1.0190 1.0020 1.0182 1.0026 1.0024 1.0058 1.0476
dispcorr: -0.017237186 hartree
energy: -2299.586021375699
dipole: 53.43308 -51.60005 1.83303 4.15403 -3.14366 1.01037 -8.07983 7.29858 -0.78125
magnitude: 2.23410 au
magnitude: 5.67862 debye
