program: Orca
programVersion: 5.0.2
elementType: Cl Cl Cl S O N C C C C C C C C C C H H H H H H H H H H H H H H H H
charge: 0
multiplicity: 1
keywords: wb97x-d3
keywords: def2-TZVPP
keywords: def2/J RIJCOSX
keywords: DEFGRID2
keywords: scfconv7
keywords: smallprint printgap noloewdin
keywords: NOSOSCF
formula: C10H16Cl3NOS
InChI: InChI=1/C10H16Cl3NOS/c1-6(2)14(7(3)4)10(15)16-5-8(11)9(12)13/h6-7H,5H2,1-4H3
32 atoms
Cl -2.438739 -0.050728 2.107522
Cl -3.656045 -1.734907 -0.220001
Cl -2.644609 0.158594 -2.141373
S  0.093069 1.4706 -0.765598
O  0.650269 0.24859 1.483701
N  2.335273 0.208965 -0.0374
C  2.857386 0.610807 -1.34821
C  3.177282 -0.684437 0.780669
C  2.919769 -0.567087 -2.309655
C  4.19195 1.335254 -1.227359
C  2.547241 -2.051609 1.018325
C  3.660471 -0.029795 2.068408
C  1.112121 0.541868 0.398682
C  -1.400967 1.666695 0.241868
C  -2.190745 0.413399 0.470281
C  -2.759527 -0.305803 -0.497002
H  2.164554 1.339441 -1.770109
H  4.062371 -0.861474 0.169695
H  3.239371 -0.226379 -3.295227
H  3.629869 -1.328311 -1.981581
H  1.941399 -1.035781 -2.420932
H  4.477731 1.725847 -2.204559
H  5.000583 0.683783 -0.893334
H  4.122515 2.179091 -0.540519
H  3.299721 -2.724024 1.433225
H  1.714223 -2.019717 1.717735
H  2.196081 -2.492161 0.084311
H  2.858326 0.121522 2.788733
H  4.129388 0.934669 1.869357
H  4.410367 -0.668264 2.538354
H  -2.002563 2.392972 -0.310356
H  -1.141167 2.131611 1.189751
elementType: Cl S O N C H
totalener: -2299.57764558 hartree
nucrepener: 1723.82191364 hartree
electener: -4023.39955922 hartree
oneelecener: -6595.35402649 hartree
twoeener: 2571.95446727 hartree
cpcmener: -0.01610472 hartree
kineticenergy: 2294.55170998 hartree
xcener: -134.006131385311 hartree
chargesum: -0.0000000
charge: -0.056444 -0.032654 -0.030735 -0.119061 -0.494638 -0.090136 0.035837 0.068535 -0.267665 -0.268771 -0.288780 -0.284411 0.313105 -0.088196 0.005109 0.002864 0.077300 0.082677 0.101055 0.091236 0.094138 0.102787 0.091557 0.095991 0.101049 0.095050 0.097260 0.094754 0.095477 0.098967 0.158295 0.118449
qa: -0.0564 -0.0327 -0.0307 -0.1191 -0.4946 -0.0901 0.0358 0.0685 -0.2677 -0.2688 -0.2888 -0.2844 0.3131 -0.0882 0.0051 0.0029 0.0773 0.0827 0.1011 0.0912 0.0941 0.1028 0.0916 0.0960 0.1010 0.0951 0.0973 0.0948 0.0955 0.0990 0.1583 0.1184
va: 1.2662 1.2914 1.2981 2.3388 2.0128 3.1438 3.9353 3.8486 3.9220 3.9082 3.9047 3.9112 4.2563 3.8993 3.8634 4.2233 1.0084 0.9946 1.0067 1.0016 1.0110 1.0050 1.0029 1.0100 1.0028 1.0191 1.0023 1.0176 1.0032 1.0031 0.9972 1.0443
dispcorr: -0.016975844 hartree
energy: -2299.594621427597
dipole: 54.91827 -53.17012 1.74815 2.01264 -1.47648 0.53616 -0.53433 -0.59795 -1.13228
magnitude: 2.15071 au
magnitude: 5.46668 debye
