program: Orca
programVersion: 5.0.2
elementType: Cl Cl Cl S O N C C C C C C C C C C H H H H H H H H H H H H H H H H
charge: 0
multiplicity: 1
keywords: wb97x-d3
keywords: def2-TZVPP
keywords: def2/J RIJCOSX
keywords: DEFGRID2
keywords: scfconv7
keywords: smallprint printgap noloewdin
keywords: NOSOSCF
formula: C10H16Cl3NOS
InChI: InChI=1/C10H16Cl3NOS/c1-6(2)14(7(3)4)10(15)16-5-8(11)9(12)13/h6-7H,5H2,1-4H3
32 atoms
Cl -2.70252 -1.350005 1.196732
Cl -3.693125 1.599368 1.496677
Cl -2.64668 2.229694 -1.113388
S  -0.07674 0.131631 -1.586547
O  0.450517 -1.499919 0.400869
N  2.252729 -0.350851 -0.367182
C  2.83281 0.5882 -1.333727
C  3.150482 -0.86802 0.683229
C  3.992312 -0.037192 -2.100046
C  3.211387 1.906025 -0.672527
C  3.399644 -2.366234 0.568941
C  2.733595 -0.445402 2.08661
C  0.957907 -0.698758 -0.358611
C  -1.665036 -0.67994 -1.252062
C  -2.391085 -0.190976 -0.03609
C  -2.855503 1.049963 0.111063
H  2.070461 0.810631 -2.080735
H  4.105108 -0.37848 0.49136
H  4.853246 -0.252234 -1.465914
H  3.687151 -0.961485 -2.591157
H  4.327968 0.654229 -2.873654
H  4.002897 1.785948 0.069285
H  2.349502 2.361211 -0.183209
H  3.574994 2.606869 -1.424917
H  3.684229 -2.642206 -0.447099
H  4.222551 -2.648259 1.227596
H  2.531455 -2.958018 0.853248
H  3.54292 -0.670211 2.782917
H  1.843491 -0.962896 2.438915
H  2.548498 0.628581 2.135708
H  -1.518384 -1.75616 -1.20422
H  -2.261485 -0.483099 -2.14569
elementType: Cl S O N C H
totalener: -2299.57832645 hartree
nucrepener: 1711.46782793 hartree
electener: -4011.04615438 hartree
oneelecener: -6570.58052393 hartree
twoeener: 2559.53436955 hartree
cpcmener: -0.01621651 hartree
kineticenergy: 2294.53513227 hartree
xcener: -134.002857181148 hartree
chargesum: -0.0000000
charge: -0.054876 -0.031209 -0.030052 -0.121280 -0.494715 -0.088345 0.034299 0.065632 -0.269474 -0.268055 -0.283943 -0.287657 0.312373 -0.079398 -0.008355 0.007382 0.077827 0.083131 0.091925 0.096691 0.101978 0.091518 0.094895 0.100739 0.095117 0.100362 0.094537 0.101076 0.095039 0.097351 0.116644 0.158839
qa: -0.0549 -0.0312 -0.0301 -0.1213 -0.4947 -0.0883 0.0343 0.0656 -0.2695 -0.2681 -0.2839 -0.2877 0.3124 -0.0794 -0.0084 0.0074 0.0778 0.0831 0.0919 0.0967 0.1020 0.0915 0.0949 0.1007 0.0951 0.1004 0.0945 0.1011 0.0950 0.0974 0.1166 0.1588
va: 1.2685 1.2925 1.2989 2.3373 2.0133 3.1432 3.9366 3.8499 3.9108 3.9193 3.9098 3.9058 4.2614 3.8849 3.8752 4.2228 1.0090 0.9941 1.0025 1.0098 1.0056 1.0018 1.0105 1.0067 1.0036 1.0028 1.0173 1.0025 1.0188 1.0024 1.0470 0.9971
dispcorr: -0.016757490 hartree
energy: -2299.595083943116
dipole: 55.90470 -54.10590 1.79880 -9.26626 9.76013 0.49388 -5.28967 4.19139 -1.09829
magnitude: 2.16468 au
magnitude: 5.50217 debye
