program: Orca
programVersion: 5.0.2
elementType: Cl Cl Cl S O N C C C C C C C C C C H H H H H H H H H H H H H H H H
charge: 0
multiplicity: 1
keywords: wb97x-d3
keywords: def2-TZVPP
keywords: def2/J RIJCOSX
keywords: DEFGRID2
keywords: scfconv7
keywords: smallprint printgap noloewdin
keywords: NOSOSCF
formula: C10H16Cl3NOS
InChI: InChI=1/C10H16Cl3NOS/c1-6(2)14(7(3)4)10(15)16-5-8(11)9(12)13/h6-7H,5H2,1-4H3
32 atoms
Cl -2.485273 0.752361 -1.436841
Cl -3.415308 -1.866967 -0.046584
Cl -2.150226 -1.083693 2.410135
S  0.288283 1.873479 -0.050093
O  0.775141 -0.407519 1.145476
N  2.40647 0.250311 -0.287311
C  2.899352 1.192983 -1.297202
C  3.270615 -0.901019 0.036363
C  3.066897 0.5187 -2.652765
C  4.16643 1.900933 -0.838021
C  2.655278 -2.24107 -0.347669
C  3.775549 -0.872576 1.473471
C  1.230976 0.381448 0.342156
C  -1.236921 1.495669 0.850174
C  -2.051478 0.430739 0.200319
C  -2.478224 -0.692959 0.775079
H  2.140092 1.963423 -1.431903
H  4.147246 -0.772893 -0.598312
H  3.854284 -0.236536 -2.650422
H  2.138192 0.04653 -2.974415
H  3.336974 1.264574 -3.401099
H  5.010588 1.218157 -0.729039
H  4.010896 2.411019 0.113066
H  4.451696 2.652329 -1.57516
H  1.844267 -2.539273 0.31343
H  2.2752 -2.221813 -1.369846
H  3.422753 -3.015175 -0.298675
H  2.99073 -1.067827 2.201825
H  4.230821 0.089863 1.710874
H  4.542767 -1.63779 1.601563
H  -1.795431 2.43457 0.842781
H  -1.013516 1.262078 1.887256
elementType: Cl S O N C H
totalener: -2299.58067596 hartree
nucrepener: 1724.67127621 hartree
electener: -4024.25195217 hartree
oneelecener: -6597.15492756 hartree
twoeener: 2572.90297538 hartree
cpcmener: -0.01555475 hartree
kineticenergy: 2294.55433405 hartree
xcener: -134.006689332192 hartree
chargesum: -0.0000000
charge: -0.065204 -0.034487 -0.028597 -0.123472 -0.496792 -0.087731 0.030524 0.067526 -0.267690 -0.267173 -0.285705 -0.288095 0.318243 -0.065986 -0.027582 0.032857 0.077759 0.082415 0.091146 0.096397 0.101750 0.090366 0.095961 0.101825 0.094440 0.096235 0.100914 0.095310 0.096779 0.099872 0.151591 0.116607
qa: -0.0652 -0.0345 -0.0286 -0.1235 -0.4968 -0.0877 0.0305 0.0675 -0.2677 -0.2672 -0.2857 -0.2881 0.3182 -0.0660 -0.0276 0.0329 0.0778 0.0824 0.0911 0.0964 0.1017 0.0904 0.0960 0.1018 0.0944 0.0962 0.1009 0.0953 0.0968 0.0999 0.1516 0.1166
va: 1.2665 1.2891 1.2908 2.3333 2.0110 3.1492 3.9429 3.8479 3.9124 3.9134 3.9056 3.9119 4.2456 3.8902 3.8908 4.2088 1.0093 0.9944 1.0025 1.0103 1.0059 1.0021 1.0098 1.0061 1.0190 1.0031 1.0028 1.0174 1.0026 1.0028 1.0067 1.0498
dispcorr: -0.017156342 hartree
energy: -2299.597832302521
dipole: 53.60479 -51.89082 1.71397 4.78889 -3.89709 0.89180 -7.97120 7.25194 -0.71927
magnitude: 2.06163 au
magnitude: 5.24026 debye
