program: Gaussian 09
title: 000006422
version: EM64L-G09RevD.01
frameworkgroup: C1[X(C2HF3O2)]
method: RPBEPBE
basis: SDD
operation: Freq
keyword: #pfreq=noraman
keyword: PBEPBE/SDD
title: #p freq=noraman PBEPBE/SDD
converged: NO NO NO NO
title: Mulliken charges:
elementType: F F F O O C C H
charge: -0.134561 -0.147137 -0.146951 -0.373799 -0.168442 0.400519 0.161406 0.408966
chargesum: 0.00000
title: Mulliken charges with hydrogens summed into heavy atoms:
elementType: F F F O O C C
charge: -0.134561 -0.147137 -0.146951 0.035166 -0.168442 0.400519 0.161406
polarizability: 3.20152009e+01 2.33143946e-01 3.52727543e+01 -7.06552584e-04 9.47767959e-04 2.14483601e+01
1716.lowfreq: -28.5252 -3.7655 0.0005 0.0013 0.0015 4.1190 9.5390 227.1681 231.2960
frequency: -28.5181 227.1674 231.2956 357.3635 373.2836 439.9899 521.6031 593.8067 615.1420 709.7880 713.9436 1018.8566 1029.3930 1069.3320 1130.7768 1335.2640 1680.6589 3515.7885
redmass: 11.8775 10.5114 13.2798 10.2144 17.0009 11.1641 14.0640 6.0812 1.2906 8.0498 6.7168 5.2345 12.4418 12.9764 2.6684 2.9296 11.3969 1.0647
irintensity: 1.2739 0.0239 1.3459 2.2551 1.5537 0.0655 7.0806 66.0320 123.3249 11.9204 57.3355 339.3705 280.6129 166.5578 77.6312 19.5016 219.3923 56.9992
temp: 298.150 k
press: 1.00000 atm
elementType: 9 9 9 8 8 6 6 1
symmnumber: 1
zpe: 93090.1 jmol-1
zpe.correction: 0.035456 hartree
zpe.thermalcorrener: 0.041152 hartree
zpe.thermalcorrenthalpy: 0.042097 hartree
zpe.thermalcorrgfe: 0.005656 hartree
zpe.sumelectzpe: -526.229563 hartree
zpe.sumelectthermal: -526.223866 hartree
zpe.sumelectthermalent: -526.222922 hartree
zpe.sumelectthermalfe: -526.259363 hartree
dipole: 2.6778 1.4360 -0.0018
dipole: 3.0385
quadrupole: -31.8814 -42.9441 -38.1541
quadrupole: 4.5960 0.0030 0.0015
quadrupole: 5.7784 -5.2842 -0.4942 4.5960 0.0030 0.0015
hfenergy: -526.2650188 hartree
pointgroup: C01 [X(C2H1F3O2)]
dipole: 1.0186395 0.6256583 0.002058 debye
dipolederiv: -0.4463962 0.2475391 -0.0038508 0.1586791 -0.742138 0.0076924 -0.002911 0.0078653 -0.2774894 -0.42846 -0.0880504 0.182671 -0.0716272 -0.3760616 0.2019508 0.1034768 0.1883381 -0.6464058 -0.4262706 -0.0933962 -0.1795413 -0.0743336 -0.3876188 -0.2093572 -0.1012464 -0.1956853 -0.6346566 -0.4333579 -0.4901261 0.0002826 -0.3121982 -1.0218231 -0.0006003 0.0002477 -0.0020087 -0.3928947 -0.5834373 0.2757144 -0.0008364 -0.0210797 -0.8354474 -0.0002194 -0.0009787 0.0014095 -0.2660648 1.2334802 -0.0593799 0.0004206 0.004407 1.4966906 -0.0002704 0.0014902 -0.0006819 1.6356719 0.8989386 0.1017929 0.0017947 0.207164 1.5470178 0.0004235 0.0009481 0.0003183 0.1528883 0.1855033 0.1059062 -0.0009404 0.1089886 0.3193806 0.0003804 -0.0010267 0.0004448 0.4289511 unknown
polarizability: 31.9990332|0.0411861|35.28884|0.0293395|-0.0025227|21.4484421 unknown
InChI: InChI=1S/C2HF3O2/c3-2(4,5)1(6)7/h6H
charge 0 multiplicity 1
8 atoms
F  -1.131592 1.308641 -0.024532
F  -1.127054 -0.635187 1.141816
F  -1.123793 -0.669636 -1.131162
O  1.47912 1.193746 0.0013
O  1.551128 -1.144936 0.002312
C  -0.620388 0.006345 -0.003949
C  0.931343 -0.070463 -0.000324
H  2.474236 1.14359 0.005239
