program: Orca
programVersion: 5.0.2
elementType: Cl Cl Cl S O N C C C C C C C C C C H H H H H H H H H H H H H H H H
charge: 0
multiplicity: 1
keywords: wb97x-d3
keywords: def2-TZVPP
keywords: def2/J RIJCOSX
keywords: DEFGRID2
keywords: scfconv7
keywords: smallprint printgap noloewdin
keywords: NOSOSCF
formula: C10H16Cl3NOS
InChI: InChI=1/C10H16Cl3NOS/c1-6(2)14(7(3)4)10(15)16-5-8(11)9(12)13/h6-7H,5H2,1-4H3
32 atoms
Cl -1.431094 -1.721482 0.343027
Cl -4.30929 -1.049705 -0.668115
Cl -3.891488 1.743571 -0.118799
S  0.325388 1.143538 -0.259931
O  1.398816 -0.211623 1.735598
N  2.778473 0.088956 -0.036227
C  3.012132 0.612962 -1.381426
C  3.887426 -0.632176 0.610784
C  3.262882 -0.50606 -2.385543
C  4.112661 1.667802 -1.393495
C  3.574314 -2.103424 0.861351
C  4.409352 0.077845 1.855224
C  1.613188 0.22023 0.628358
C  -1.056517 0.9016 0.886299
C  -2.01987 -0.109155 0.367775
C  -3.248189 0.15136 -0.081146
H  2.099576 1.113509 -1.703945
H  4.69523 -0.607805 -0.122653
H  4.189336 -1.046833 -2.186297
H  2.441185 -1.221358 -2.379572
H  3.341363 -0.092215 -3.391062
H  4.202052 2.100408 -2.390055
H  5.088281 1.255031 -1.132419
H  3.886613 2.474433 -0.696678
H  2.827879 -2.236583 1.640072
H  3.214275 -2.587114 -0.047013
H  4.483305 -2.619411 1.173448
H  4.643264 1.120929 1.640741
H  5.327666 -0.405788 2.190783
H  3.694865 0.045927 2.673834
H  -1.534357 1.86712 1.030724
H  -0.639134 0.575299 1.840434
totalener: -2299.56579245 hartree
nucrepener: 1684.49766522 hartree
electener: -3984.06345767 hartree
oneelecener: -6515.94242516 hartree
twoeener: 2531.87896750 hartree
kineticenergy: 2294.58537215 hartree
xcener: -134.009879687484 hartree
chargesum: -0.0000000
charge: -0.039059 -0.020217 -0.037281 -0.110697 -0.416731 -0.091737 -0.001297 0.032134 -0.251087 -0.250017 -0.265239 -0.265650 0.297175 -0.096780 -0.026549 0.012591 0.075263 0.066442 0.080989 0.100649 0.092643 0.093222 0.081009 0.097917 0.112364 0.086404 0.087403 0.085146 0.087190 0.111246 0.126260 0.146296
qa: -0.0391 -0.0202 -0.0373 -0.1107 -0.4167 -0.0917 -0.0013 0.0321 -0.2511 -0.2500 -0.2652 -0.2657 0.2972 -0.0968 -0.0265 0.0126 0.0753 0.0664 0.0810 0.1006 0.0926 0.0932 0.0810 0.0979 0.1124 0.0864 0.0874 0.0851 0.0872 0.1112 0.1263 0.1463
va: 1.2980 1.3060 1.2818 2.3138 2.0865 3.1004 3.9809 3.9112 3.9166 3.9132 3.9060 3.9083 4.2581 3.8030 3.9597 4.2048 1.0124 0.9954 1.0037 1.0121 1.0099 1.0101 1.0036 1.0116 1.0179 1.0058 1.0053 1.0056 1.0054 1.0172 1.0300 1.0445
dispcorr: -0.016422000 hartree
energy: -2299.582214449610
dipole: 61.94164 -60.70321 1.23843 1.05226 -0.71453 0.33773 -1.14952 0.54030 -0.60922
magnitude: 1.42089 au
magnitude: 3.61161 debye
