program: Orca
programVersion: 5.0.2
elementType: Cl Cl Cl S O N C C C C C C C C C C H H H H H H H H H H H H H H H H
charge: 0
multiplicity: 1
keywords: wb97x-d3
keywords: def2-TZVPP
keywords: def2/J RIJCOSX
keywords: DEFGRID2
keywords: scfconv7
keywords: smallprint printgap noloewdin
keywords: NOSOSCF
formula: C10H16Cl3NOS
InChI: InChI=1/C10H16Cl3NOS/c1-6(2)14(7(3)4)10(15)16-5-8(11)9(12)13/h6-7H,5H2,1-4H3
32 atoms
Cl -2.640574 1.917293 0.400914
Cl -4.701788 -0.098787 -0.80244
Cl -2.887696 -2.28326 -0.335969
S  0.284126 0.23756 -0.366123
O  1.624604 -0.38466 1.800209
N  2.93313 0.151442 0.02389
C  3.045953 0.590732 -1.366005
C  4.178118 -0.158771 0.744842
C  3.553216 -0.526021 -2.270876
C  3.87381 1.865485 -1.492905
C  4.278552 -1.623436 1.15906
C  4.443474 0.796465 1.902865
C  1.752264 -0.039616 0.648254
C  -0.972177 -0.161549 0.889292
C  -2.300326 0.233796 0.343328
C  -3.189611 -0.602375 -0.195205
H  2.044421 0.851304 -1.710023
H  4.969166 0.007653 0.011387
H  4.57082 -0.829617 -2.018966
H  2.90903 -1.402209 -2.201959
H  3.561417 -0.195888 -3.309978
H  3.478307 2.652297 -0.851239
H  3.841506 2.224101 -2.521795
H  4.923843 1.713301 -1.239497
H  4.079582 -2.282768 0.313527
H  5.290222 -1.831475 1.510072
H  3.587329 -1.87321 1.959618
H  3.72612 0.664809 2.709199
H  4.402952 1.834356 1.57147
H  5.441112 0.615961 2.305481
H  -0.759463 0.395824 1.799657
H  -0.93602 -1.222296 1.12277
totalener: -2299.56496565 hartree
nucrepener: 1658.49170793 hartree
electener: -3958.05667358 hartree
oneelecener: -6463.73313892 hartree
twoeener: 2505.67646534 hartree
kineticenergy: 2294.57815667 hartree
xcener: -134.007389775392 hartree
chargesum: 0.0000000
charge: -0.044195 -0.016950 -0.027025 -0.100945 -0.424026 -0.093459 -0.002950 0.030357 -0.248846 -0.250779 -0.266605 -0.261819 0.306192 -0.082717 -0.049070 0.042499 0.075057 0.067790 0.080409 0.099206 0.092095 0.097782 0.094111 0.081861 0.085981 0.087651 0.112206 0.110143 0.084737 0.086434 0.121570 0.113304
qa: -0.0442 -0.0169 -0.0270 -0.1009 -0.4240 -0.0935 -0.0029 0.0304 -0.2488 -0.2508 -0.2666 -0.2618 0.3062 -0.0827 -0.0491 0.0425 0.0751 0.0678 0.0804 0.0992 0.0921 0.0978 0.0941 0.0819 0.0860 0.0877 0.1122 0.1101 0.0847 0.0864 0.1216 0.1133
va: 1.2835 1.3088 1.2938 2.3587 2.0795 3.0989 3.9909 3.9132 3.9156 3.9078 3.9036 3.9081 4.2518 3.9514 3.9367 4.2010 1.0077 0.9953 1.0030 1.0126 1.0106 1.0119 1.0092 1.0040 1.0052 1.0052 1.0179 1.0180 1.0060 1.0057 1.0261 1.0310
dispcorr: -0.015827387 hartree
energy: -2299.580793032381
dipole: 65.72851 -64.49416 1.23435 2.10682 -2.01763 0.08919 0.68919 -1.30803 -0.61884
magnitude: 1.38366 au
magnitude: 3.51699 debye
