program: Orca
programVersion: 5.0.2
elementType: Cl Cl Cl S O N C C C C C C C C C C H H H H H H H H H H H H H H H H
charge: 0
multiplicity: 1
keywords: wb97x-d3
keywords: def2-TZVPP
keywords: def2/J RIJCOSX
keywords: DEFGRID2
keywords: scfconv7
keywords: smallprint printgap noloewdin
keywords: NOSOSCF
formula: C10H16Cl3NOS
InChI: InChI=1/C10H16Cl3NOS/c1-6(2)14(7(3)4)10(15)16-5-8(11)9(12)13/h6-7H,5H2,1-4H3
32 atoms
Cl -1.730471 0.884896 1.305783
Cl -4.40363 1.879774 0.028796
Cl -4.153063 -0.048636 -2.091941
S  0.029829 -0.32912 -1.367879
O  0.777479 -1.452032 0.901139
N  2.435419 -0.353709 -0.184421
C  2.884174 0.453516 -1.319016
C  3.420229 -0.644732 0.871446
C  3.996486 -0.238238 -2.099537
C  3.264147 1.8662 -0.890671
C  3.722994 -2.132755 1.009136
C  3.07228 0.009322 2.204417
C  1.169599 -0.792072 -0.030881
C  -1.521326 -0.95284 -0.667603
C  -2.353656 0.152988 -0.117373
C  -3.489036 0.607217 -0.649453
H  2.044368 0.552491 -2.006197
H  4.34042 -0.170639 0.525691
H  4.914354 -0.340018 -1.518764
H  3.686402 -1.231415 -2.423367
H  4.242001 0.343099 -2.988506
H  3.512936 2.467305 -1.765463
H  4.132889 1.880939 -0.230684
H  2.435272 2.350506 -0.375258
H  4.579152 -2.269465 1.671075
H  2.883823 -2.683254 1.426998
H  3.977472 -2.57145 0.043915
H  2.875825 1.074383 2.078241
H  3.915079 -0.092874 2.889502
H  2.202989 -0.446916 2.671089
H  -1.266058 -1.663971 0.119513
H  -2.043358 -1.486155 -1.457884
totalener: -2299.56573064 hartree
nucrepener: 1685.51886449 hartree
electener: -3985.08459512 hartree
oneelecener: -6517.99637673 hartree
twoeener: 2532.91178160 hartree
kineticenergy: 2294.57493806 hartree
xcener: -134.007828536287 hartree
chargesum: 0.0000000
charge: -0.038705 -0.020564 -0.037287 -0.110795 -0.415909 -0.092357 -0.001100 0.029912 -0.248239 -0.251932 -0.263388 -0.264271 0.296980 -0.094365 -0.027231 0.012463 0.074522 0.066753 0.080896 0.096887 0.093442 0.092456 0.081046 0.101170 0.087168 0.110943 0.085069 0.086240 0.087407 0.111350 0.145057 0.126380
qa: -0.0387 -0.0206 -0.0373 -0.1108 -0.4159 -0.0924 -0.0011 0.0299 -0.2482 -0.2519 -0.2634 -0.2643 0.2970 -0.0944 -0.0272 0.0125 0.0745 0.0668 0.0809 0.0969 0.0934 0.0925 0.0810 0.1012 0.0872 0.1109 0.0851 0.0862 0.0874 0.1114 0.1451 0.1264
va: 1.2981 1.3053 1.2815 2.3140 2.0868 3.0993 3.9855 3.9163 3.9111 3.9177 3.9066 3.9072 4.2594 3.8044 3.9600 4.2051 1.0109 0.9954 1.0043 1.0121 1.0093 1.0105 1.0028 1.0120 1.0055 1.0172 1.0061 1.0055 1.0055 1.0181 1.0441 1.0295
dispcorr: -0.016461034 hartree
energy: -2299.582191669068
dipole: 61.00600 -59.69485 1.31114 -8.87626 9.01902 0.14277 2.71176 -3.23513 -0.52338
magnitude: 1.41894 au
magnitude: 3.60667 debye
