program: Orca
programVersion: 5.0.2
elementType: Cl Cl Cl S O N C C C C C C C C C C H H H H H H H H H H H H H H H H
charge: 0
multiplicity: 1
keywords: wb97x-d3
keywords: def2-TZVPP
keywords: def2/J RIJCOSX
keywords: DEFGRID2
keywords: scfconv7
keywords: smallprint printgap noloewdin
keywords: NOSOSCF
formula: C10H16Cl3NOS
InChI: InChI=1/C10H16Cl3NOS/c1-6(2)14(7(3)4)10(15)16-5-8(11)9(12)13/h6-7H,5H2,1-4H3
32 atoms
Cl -3.568665 1.721534 -0.205172
Cl -3.900262 -1.346292 -0.740858
Cl -1.364808 -1.847861 0.540267
S  0.179679 1.432468 -0.122262
O  1.198488 -0.140971 1.740123
N  2.547948 0.177008 -0.049233
C  2.797821 0.791384 -1.352827
C  3.570794 -0.744488 0.473781
C  2.799753 -0.243905 -2.471209
C  4.06265 1.643597 -1.342177
C  3.068364 -2.17895 0.604084
C  4.232102 -0.23354 1.748878
C  1.416196 0.355744 0.660726
C  -1.202883 1.179092 1.031021
C  -2.386894 0.594489 0.334845
C  -2.549235 -0.703856 0.079375
H  1.973754 1.474334 -1.558383
H  4.344986 -0.759694 -0.295342
H  3.6206 -0.956584 -2.375325
H  1.863372 -0.801013 -2.483109
H  2.910011 0.248115 -3.437888
H  4.158409 2.172984 -2.290261
H  4.968933 1.050291 -1.213185
H  4.024929 2.386067 -0.545537
H  3.913251 -2.841079 0.798371
H  2.357628 -2.294397 1.418022
H  2.593166 -2.511211 -0.319394
H  5.076861 -0.874904 2.004585
H  3.54504 -0.232016 2.591328
H  4.614134 0.778352 1.612532
H  -1.465414 2.140296 1.467204
H  -0.83812 0.532682 1.830692
totalener: -2299.56406918 hartree
nucrepener: 1712.75139680 hartree
electener: -4012.31546599 hartree
oneelecener: -6572.44528161 hartree
twoeener: 2560.12981562 hartree
kineticenergy: 2294.58100935 hartree
xcener: -134.008953413416 hartree
chargesum: -0.0000000
charge: -0.053882 -0.022269 -0.021212 -0.102862 -0.417322 -0.086321 -0.001502 0.034207 -0.248346 -0.250707 -0.267505 -0.264846 0.290339 -0.131874 -0.018492 0.034375 0.075984 0.067981 0.080335 0.099649 0.092220 0.094420 0.081470 0.097339 0.089174 0.107950 0.087809 0.086541 0.111401 0.085157 0.122720 0.148067
qa: -0.0539 -0.0223 -0.0212 -0.1029 -0.4173 -0.0863 -0.0015 0.0342 -0.2483 -0.2507 -0.2675 -0.2648 0.2903 -0.1319 -0.0185 0.0344 0.0760 0.0680 0.0803 0.0996 0.0922 0.0944 0.0815 0.0973 0.0892 0.1080 0.0878 0.0865 0.1114 0.0852 0.1227 0.1481
va: 1.2734 1.3025 1.3172 2.3395 2.0784 3.0910 3.9821 3.9057 3.9177 3.9091 3.9029 3.9102 4.2601 3.8747 3.8961 4.2335 1.0096 0.9950 1.0033 1.0134 1.0106 1.0095 1.0041 1.0117 1.0067 1.0180 1.0057 1.0057 1.0165 1.0057 1.0190 1.0404
dispcorr: -0.017107525 hartree
energy: -2299.581176707861
dipole: 57.12551 -55.85309 1.27242 1.51353 -1.34281 0.17072 -2.16533 1.58958 -0.57575
magnitude: 1.40701 au
magnitude: 3.57634 debye
