program: Orca
programVersion: 5.0.2
elementType: Cl S O N C C C C C C C C C C C C H H H H H H H H H H H H H H H H
charge: 0
multiplicity: 1
keywords: wb97x-d3
keywords: def2-TZVPP
keywords: def2/J RIJCOSX
keywords: DEFGRID2
keywords: scfconv7
keywords: smallprint printgap noloewdin
keywords: NOSOSCF
formula: C12H16ClNOS
InChI: InChI=1/C12H16ClNOS/c1-3-14(4-2)12(15)16-9-10-5-7-11(13)8-6-10/h5-8H,3-4,9H2,1-2H3
32 atoms
Cl 5.119263 -0.00172 1.438989
S  -1.163013 -0.458272 -1.41212
O  -2.017071 1.528296 0.115235
N  -3.231171 -0.378631 0.233965
C  -4.204614 0.216542 1.145316
C  -3.461006 -1.766797 -0.145335
C  -2.218019 0.370477 -0.22007
C  -3.865137 -0.01595 2.605831
C  -4.327014 -1.919172 -1.382807
C  0.088244 0.819642 -1.743874
C  1.338428 0.629157 -0.94189
C  2.431465 -0.023505 -1.502346
C  1.434601 1.082748 0.371447
C  3.597418 -0.224088 -0.778602
C  2.59208 0.891912 1.109015
C  3.666128 0.237514 0.524998
H  -4.289174 1.281218 0.937101
H  -5.176172 -0.220179 0.911003
H  -2.507331 -2.2813 -0.271836
H  -3.939568 -2.25366 0.704906
H  -2.904554 0.429014 2.865472
H  -4.628197 0.434709 3.240695
H  -3.824484 -1.080214 2.841455
H  -3.858265 -1.474041 -2.260195
H  -4.49296 -2.976227 -1.590243
H  -5.301412 -1.450229 -1.241491
H  -0.364687 1.794911 -1.576205
H  0.301198 0.737836 -2.809208
H  2.378423 -0.381997 -2.523042
H  0.600143 1.59536 0.831708
H  4.438634 -0.731311 -1.230958
H  2.65373 1.254043 2.126248
elementType: Cl S O N C H
totalener: -1455.39047759 hartree
nucrepener: 1289.84526383 hartree
electener: -2745.23574142 hartree
oneelecener: -4558.73186519 hartree
twoeener: 1813.49612377 hartree
cpcmener: -0.02342831 hartree
kineticenergy: 1451.33902957 hartree
xcener: -99.504666926066 hartree
chargesum: 0.0000000
charge: -0.101827 -0.120546 -0.552766 -0.115807 -0.027155 -0.046052 0.324569 -0.248153 -0.243646 -0.066448 0.034013 -0.217896 -0.196462 -0.122948 -0.142154 0.075339 0.085978 0.099990 0.094560 0.105107 0.082814 0.095665 0.082874 0.075574 0.095633 0.087536 0.132970 0.141936 0.145119 0.151593 0.145150 0.145439
qa: -0.1018 -0.1205 -0.5528 -0.1158 -0.0272 -0.0461 0.3246 -0.2482 -0.2436 -0.0664 0.0340 -0.2179 -0.1965 -0.1229 -0.1422 0.0753 0.0860 0.1000 0.0946 0.1051 0.0828 0.0957 0.0829 0.0756 0.0956 0.0875 0.1330 0.1419 0.1451 0.1516 0.1452 0.1454
va: 1.2028 2.3200 1.9378 3.1932 3.8614 3.8824 4.2487 3.9257 3.9150 3.7618 3.6133 4.0182 3.9727 3.9439 3.9964 3.8337 1.0194 0.9966 1.0121 0.9947 1.0075 1.0063 1.0049 1.0161 1.0077 1.0037 1.0310 1.0056 1.0021 1.0145 1.0033 1.0052
dispcorr: -0.013518580 hartree
energy: -1455.403996167410
dipole: -35.90723 34.25904 -1.64818 -5.09551 3.84765 -1.24787 -1.00803 0.50385 -0.50418
magnitude: 2.12788 au
magnitude: 5.40864 debye
