program: Orca
programVersion: 5.0.2
elementType: Cl S O N C C C C C C C C C C C C H H H H H H H H H H H H H H H H
charge: 0
multiplicity: 1
keywords: wb97x-d3
keywords: def2-TZVPP
keywords: def2/J RIJCOSX
keywords: DEFGRID2
keywords: scfconv7
keywords: smallprint printgap noloewdin
keywords: NOSOSCF
formula: C12H16ClNOS
InChI: InChI=1/C12H16ClNOS/c1-3-14(4-2)12(15)16-9-10-5-7-11(13)8-6-10/h5-8H,3-4,9H2,1-2H3
32 atoms
Cl 4.805652 0.229652 -1.890939
S  -1.31505 0.976805 1.222748
O  -1.46732 -1.660462 1.081807
N  -3.08122 -0.539542 -0.038303
C  -3.679899 0.707195 -0.498251
C  -3.723436 -1.77611 -0.477494
C  -1.981967 -0.61233 0.722136
C  -3.116077 1.182079 -1.823505
C  -4.754062 -2.285533 0.511433
C  0.243172 0.473503 2.015541
C  1.382652 0.394993 1.046756
C  2.081299 1.548641 0.699199
C  1.76335 -0.811695 0.467968
C  3.131085 1.508522 -0.203845
C  2.812326 -0.870615 -0.438099
C  3.488261 0.293022 -0.766004
H  -4.752273 0.531553 -0.588164
H  -3.58138 1.47915 0.265915
H  -4.194617 -1.568583 -1.438272
H  -2.964447 -2.53304 -0.666236
H  -2.051858 1.404246 -1.747703
H  -3.253148 0.430267 -2.60162
H  -3.628498 2.089528 -2.142998
H  -4.298274 -2.538383 1.467944
H  -5.532895 -1.544054 0.689532
H  -5.232983 -3.183516 0.120845
H  0.085636 -0.463196 2.547051
H  0.427538 1.244673 2.764089
H  1.806768 2.498548 1.141494
H  1.245142 -1.725647 0.725187
H  3.665332 2.41367 -0.458598
H  3.097267 -1.817364 -0.876166
elementType: Cl S O N C H
totalener: -1455.39077613 hartree
nucrepener: 1299.63863924 hartree
electener: -2755.02941537 hartree
oneelecener: -4578.41965160 hartree
twoeener: 1823.39023623 hartree
cpcmener: -0.02379470 hartree
kineticenergy: 1451.34215757 hartree
xcener: -99.504931248081 hartree
chargesum: -0.0000000
charge: -0.101906 -0.123775 -0.553015 -0.116782 -0.044564 -0.022462 0.325614 -0.239395 -0.249481 -0.058841 0.037775 -0.226417 -0.191696 -0.125259 -0.138113 0.073340 0.103323 0.094017 0.098448 0.084921 0.073587 0.087431 0.094998 0.082149 0.083644 0.095779 0.125867 0.147530 0.144493 0.146157 0.146518 0.146114
qa: -0.1019 -0.1238 -0.5530 -0.1168 -0.0446 -0.0225 0.3256 -0.2394 -0.2495 -0.0588 0.0378 -0.2264 -0.1917 -0.1253 -0.1381 0.0733 0.1033 0.0940 0.0984 0.0849 0.0736 0.0874 0.0950 0.0821 0.0836 0.0958 0.1259 0.1475 0.1445 0.1462 0.1465 0.1461
va: 1.2027 2.3170 1.9385 3.1906 3.9070 3.8610 4.2479 3.9165 3.9242 3.7651 3.5842 4.0278 3.9707 3.9469 3.9836 3.8386 0.9946 1.0036 0.9967 1.0176 1.0160 1.0037 1.0081 1.0088 1.0045 1.0062 1.0322 1.0025 1.0034 1.0169 1.0028 1.0043
dispcorr: -0.013776917 hartree
energy: -1455.404553044843
dipole: -34.01818 32.20963 -1.80855 -3.39262 4.30991 0.91728 1.59978 -1.81758 -0.21780
magnitude: 2.03953 au
magnitude: 5.18408 debye
