program: Orca
programVersion: 5.0.2
elementType: Cl S O N C C C C C C C C C C C C H H H H H H H H H H H H H H H H
charge: 0
multiplicity: 1
keywords: wb97x-d3
keywords: def2-TZVPP
keywords: def2/J RIJCOSX
keywords: DEFGRID2
keywords: scfconv7
keywords: smallprint printgap noloewdin
keywords: NOSOSCF
formula: C12H16ClNOS
InChI: InChI=1/C12H16ClNOS/c1-3-14(4-2)12(15)16-9-10-5-7-11(13)8-6-10/h5-8H,3-4,9H2,1-2H3
32 atoms
Cl 4.943697 -1.348306 -0.837142
S  -1.20421 0.936119 1.299505
O  -1.914455 1.064312 -1.245341
N  -3.150654 -0.332879 0.034668
C  -4.003711 -0.714772 -1.087347
C  -3.448375 -0.953625 1.319536
C  -2.160289 0.545231 -0.166863
C  -5.238313 0.158508 -1.209487
C  -2.691806 -2.248652 1.544779
C  0.129168 1.954933 0.594679
C  1.331378 1.145048 0.216598
C  1.447473 0.557945 -1.040898
C  2.357098 0.951607 1.137212
C  2.554149 -0.208771 -1.37192
C  3.471816 0.189207 0.823005
C  3.557541 -0.388939 -0.432874
H  -3.423479 -0.68972 -2.007764
H  -4.292055 -1.755507 -0.933247
H  -3.265261 -0.248108 2.131101
H  -4.522651 -1.1400 1.341205
H  -4.970968 1.202425 -1.374631
H  -5.845491 -0.170304 -2.053284
H  -5.857077 0.101475 -0.312953
H  -1.614286 -2.086448 1.555925
H  -2.977584 -2.683124 2.502749
H  -2.919989 -2.977974 0.766877
H  0.378475 2.665925 1.38228
H  -0.268158 2.523075 -0.243738
H  0.670813 0.697385 -1.780549
H  2.291606 1.405367 2.118568
H  2.62891 -0.656837 -2.353473
H  4.260878 0.052961 1.549881
elementType: Cl S O N C H
totalener: -1455.39071379 hartree
nucrepener: 1297.56008040 hartree
electener: -2752.95079418 hartree
oneelecener: -4574.19704636 hartree
twoeener: 1821.24625217 hartree
cpcmener: -0.02345853 hartree
kineticenergy: 1451.33859258 hartree
xcener: -99.504500276475 hartree
chargesum: 0.0000000
charge: -0.101815 -0.122975 -0.552924 -0.115650 -0.023683 -0.044783 0.324167 -0.249813 -0.239820 -0.060626 0.031522 -0.194558 -0.220259 -0.137640 -0.123810 0.073576 0.085265 0.099121 0.093762 0.104218 0.082815 0.095690 0.083439 0.073586 0.095100 0.086974 0.144553 0.129281 0.150400 0.144757 0.145231 0.144899
qa: -0.1018 -0.1230 -0.5529 -0.1157 -0.0237 -0.0448 0.3242 -0.2498 -0.2398 -0.0606 0.0315 -0.1946 -0.2203 -0.1376 -0.1238 0.0736 0.0853 0.0991 0.0938 0.1042 0.0828 0.0957 0.0834 0.0736 0.0951 0.0870 0.1446 0.1293 0.1504 0.1448 0.1452 0.1449
va: 1.2027 2.3177 1.9381 3.1933 3.8603 3.9006 4.2473 3.9240 3.9174 3.7592 3.6062 3.9690 4.0218 3.9901 3.9444 3.8362 1.0193 0.9965 1.0047 0.9949 1.0078 1.0063 1.0045 1.0169 1.0078 1.0037 1.0043 1.0316 1.0169 1.0024 1.0049 1.0034
dispcorr: -0.013723987 hartree
energy: -1455.404437773341
dipole: -34.51260 32.92909 -1.58351 -1.87089 1.38229 -0.48860 3.28027 -2.08316 1.19711
magnitude: 2.04434 au
magnitude: 5.19629 debye
