program: Orca
programVersion: 5.0.2
elementType: Cl S O N C C C C C C C C C C C C H H H H H H H H H H H H H H H H
charge: 0
multiplicity: 1
keywords: wb97x-d3
keywords: def2-TZVPP
keywords: def2/J RIJCOSX
keywords: DEFGRID2
keywords: scfconv7
keywords: smallprint printgap noloewdin
keywords: NOSOSCF
formula: C12H16ClNOS
InChI: InChI=1/C12H16ClNOS/c1-3-14(4-2)12(15)16-9-10-5-7-11(13)8-6-10/h5-8H,3-4,9H2,1-2H3
32 atoms
Cl 5.1511 -0.481673 1.115325
S  -1.235203 -0.028197 -1.440143
O  -1.837099 1.288791 0.769822
N  -2.90966 -0.686793 0.511844
C  -3.683944 -0.459647 1.73129
C  -3.269188 -1.818099 -0.33388
C  -2.056935 0.275197 0.125037
C  -4.905146 0.427004 1.551262
C  -4.330069 -1.518092 -1.380378
C  0.011288 1.298291 -1.4434
C  1.296028 0.882158 -0.795375
C  2.288391 0.266526 -1.553382
C  1.523644 1.078712 0.563897
C  3.477033 -0.15343 -0.97743
C  2.706387 0.663867 1.156994
C  3.672963 0.046045 0.379815
H  -3.987545 -1.438782 2.099786
H  -3.025247 -0.037565 2.489082
H  -2.368827 -2.213048 -0.808015
H  -3.617432 -2.609389 0.328816
H  -5.381314 0.586131 2.519344
H  -4.641401 1.404091 1.147677
H  -5.643818 -0.02693 0.892153
H  -4.50548 -2.408353 -1.984568
H  -5.277877 -1.236831 -0.92371
H  -4.024728 -0.716039 -2.052471
H  -0.417108 2.188374 -0.985889
H  0.168713 1.518309 -2.499355
H  2.134944 0.111452 -2.614528
H  0.775836 1.563717 1.176475
H  4.238004 -0.626702 -1.582852
H  2.868689 0.824046 2.214256
elementType: Cl S O N C H
totalener: -1455.38962590 hartree
nucrepener: 1296.72203780 hartree
electener: -2752.11166370 hartree
oneelecener: -4572.57217597 hartree
twoeener: 1820.46051227 hartree
cpcmener: -0.02318000 hartree
kineticenergy: 1451.33871527 hartree
xcener: -99.504728814999 hartree
chargesum: -0.0000000
charge: -0.101803 -0.119714 -0.549107 -0.131990 -0.012671 -0.039487 0.327057 -0.269079 -0.258506 -0.056455 0.033880 -0.223010 -0.196133 -0.125069 -0.136615 0.073419 0.093198 0.089550 0.097802 0.098440 0.099774 0.085594 0.089982 0.099345 0.094931 0.078735 0.127948 0.144852 0.144116 0.150256 0.145693 0.145070
qa: -0.1018 -0.1197 -0.5491 -0.1320 -0.0127 -0.0395 0.3271 -0.2691 -0.2585 -0.0565 0.0339 -0.2230 -0.1961 -0.1251 -0.1366 0.0734 0.0932 0.0895 0.0978 0.0984 0.0998 0.0856 0.0900 0.0993 0.0949 0.0787 0.1279 0.1449 0.1441 0.1503 0.1457 0.1451
va: 1.2030 2.3220 1.9404 3.2121 3.8493 3.8686 4.2404 3.9091 3.9007 3.7583 3.6017 4.0257 3.9692 3.9450 3.9860 3.8379 1.0044 1.0138 1.0120 1.0017 1.0065 1.0108 1.0002 1.0091 1.0000 1.0181 1.0313 1.0034 1.0029 1.0163 1.0031 1.0049
dispcorr: -0.013933620 hartree
energy: -1455.403559522257
dipole: -37.63772 36.04712 -1.59060 -2.35489 1.30433 -1.05057 -2.01799 1.30146 -0.71653
magnitude: 2.03645 au
magnitude: 5.17623 debye
