program: Orca
programVersion: 5.0.2
elementType: Cl S O N C C C C C C C C C C C C H H H H H H H H H H H H H H H H
charge: 0
multiplicity: 1
keywords: wb97x-d3
keywords: def2-TZVPP
keywords: def2/J RIJCOSX
keywords: DEFGRID2
keywords: scfconv7
keywords: smallprint printgap noloewdin
keywords: NOSOSCF
formula: C12H16ClNOS
InChI: InChI=1/C12H16ClNOS/c1-3-14(4-2)12(15)16-9-10-5-7-11(13)8-6-10/h5-8H,3-4,9H2,1-2H3
32 atoms
Cl 4.941986 -1.346443 -0.841365
S  -1.206747 0.939904 1.306584
O  -1.90339 1.052119 -1.242169
N  -3.150731 -0.335738 0.036944
C  -3.99923 -0.716003 -1.08748
C  -3.450423 -0.953617 1.321028
C  -2.156671 0.541115 -0.16578
C  -5.231873 0.16114 -1.210828
C  -2.69355 -2.249426 1.545933
C  0.125847 1.954904 0.595237
C  1.328711 1.145433 0.21751
C  1.443513 0.557978 -1.039934
C  2.355948 0.952082 1.136432
C  2.550292 -0.207899 -1.372249
C  3.470546 0.190299 0.820748
C  3.555569 -0.387772 -0.43521
H  -3.41609 -0.687365 -2.006317
H  -4.290752 -1.757023 -0.937733
H  -3.265855 -0.248533 2.133027
H  -4.525122 -1.140062 1.343934
H  -4.961139 1.204608 -1.374884
H  -5.840209 -0.163551 -2.056058
H  -5.853878 0.106518 -0.315895
H  -1.615745 -2.08764 1.55557
H  -2.976727 -2.685751 2.504463
H  -2.921548 -2.980099 0.768763
H  0.375692 2.6717 1.377941
H  -0.274416 2.517591 -0.245845
H  0.663902 0.696303 -1.777133
H  2.292203 1.404579 2.118815
H  2.6236 -0.656165 -2.354091
H  4.260478 0.054367 1.547111
elementType: Cl S O N C H
totalener: -1455.40073057 hartree
nucrepener: 1297.79571289 hartree
electener: -2753.19644345 hartree
oneelecener: -4574.57583354 hartree
twoeener: 1821.37939009 hartree
cpcmener: -0.01885249 hartree
kineticenergy: 1451.33352333 hartree
xcener: -99.502212402915 hartree
chargesum: -0.0000000
charge: -0.100428 -0.126909 -0.518892 -0.118452 -0.025255 -0.049375 0.312091 -0.248925 -0.237522 -0.062334 0.032005 -0.191840 -0.219066 -0.134776 -0.122172 0.072998 0.086605 0.096436 0.093383 0.101748 0.084508 0.094234 0.080986 0.075211 0.093437 0.085156 0.141799 0.129555 0.150356 0.140683 0.142651 0.142108
qa: -0.1004 -0.1269 -0.5189 -0.1185 -0.0253 -0.0494 0.3121 -0.2489 -0.2375 -0.0623 0.0320 -0.1918 -0.2191 -0.1348 -0.1222 0.0730 0.0866 0.0964 0.0934 0.1017 0.0845 0.0942 0.0810 0.0752 0.0934 0.0852 0.1418 0.1296 0.1504 0.1407 0.1427 0.1421
va: 1.2041 2.3120 1.9801 3.1821 3.8631 3.9062 4.2654 3.9242 3.9164 3.7652 3.6128 3.9703 4.0256 3.9892 3.9490 3.8457 1.0197 0.9964 1.0050 0.9948 1.0077 1.0067 1.0047 1.0172 1.0083 1.0040 1.0044 1.0319 1.0172 1.0035 1.0056 1.0042
dispcorr: -0.013729072 hartree
energy: -1455.414459638362
dipole: -34.50650 32.95731 -1.54918 -1.86363 1.43011 -0.43352 3.27153 -2.19838 1.07315
magnitude: 1.93379 au
magnitude: 4.91531 debye
