program: Orca
programVersion: 5.0.2
elementType: Cl S O N C C C C C C C C C C C C H H H H H H H H H H H H H H H H
charge: 0
multiplicity: 1
keywords: wb97x-d3
keywords: def2-TZVPP
keywords: def2/J RIJCOSX
keywords: DEFGRID2
keywords: scfconv7
keywords: smallprint printgap noloewdin
keywords: NOSOSCF
formula: C12H16ClNOS
InChI: InChI=1/C12H16ClNOS/c1-3-14(4-2)12(15)16-9-10-5-7-11(13)8-6-10/h5-8H,3-4,9H2,1-2H3
32 atoms
Cl 5.755313 -0.308124 0.420516
S  -1.02311 -0.270574 0.043679
O  -2.763705 1.37679 -1.045695
N  -3.675207 -0.270711 0.210882
C  -5.032697 0.184526 -0.066492
C  -3.529097 -1.426799 1.081427
C  -2.646667 0.394798 -0.334878
C  -5.514148 1.232088 0.922059
C  -3.551956 -2.74706 0.330732
C  0.016022 0.906928 -0.881025
C  1.446239 0.597948 -0.558189
C  2.058282 1.172668 0.551916
C  2.183948 -0.275982 -1.349836
C  3.380915 0.899057 0.860594
C  3.508622 -0.561848 -1.055625
C  4.097071 0.032846 0.048824
H  -5.085655 0.567007 -1.084365
H  -5.681803 -0.690685 -0.031899
H  -2.617537 -1.335961 1.674648
H  -4.345102 -1.392885 1.804704
H  -5.494464 0.853397 1.944877
H  -4.899194 2.130885 0.879767
H  -6.541555 1.51872 0.694971
H  -3.478417 -3.578468 1.032363
H  -4.479842 -2.86738 -0.230169
H  -2.719489 -2.823445 -0.369115
H  -0.239845 1.921506 -0.579983
H  -0.177752 0.800665 -1.947525
H  1.499118 1.851414 1.184672
H  1.725637 -0.738603 -2.215577
H  3.845306 1.360152 1.721867
H  4.072331 -1.237221 -1.685113
elementType: Cl S O N C H
totalener: -1455.40120286 hartree
nucrepener: 1266.18380014 hartree
electener: -2721.58500301 hartree
oneelecener: -4511.07797138 hartree
twoeener: 1789.49296837 hartree
cpcmener: -0.02052248 hartree
kineticenergy: 1451.33527189 hartree
xcener: -99.501994119203 hartree
chargesum: 0.0000000
charge: -0.097898 -0.120692 -0.518641 -0.120941 -0.024998 -0.052613 0.321385 -0.249397 -0.237590 -0.050953 0.014718 -0.199003 -0.186101 -0.131190 -0.135094 0.083624 0.086476 0.096265 0.093215 0.102079 0.080865 0.084241 0.094022 0.093525 0.085517 0.075674 0.119706 0.122013 0.143655 0.143408 0.142595 0.142127
qa: -0.0979 -0.1207 -0.5186 -0.1209 -0.0250 -0.0526 0.3214 -0.2494 -0.2376 -0.0510 0.0147 -0.1990 -0.1861 -0.1312 -0.1351 0.0836 0.0865 0.0963 0.0932 0.1021 0.0809 0.0842 0.0940 0.0935 0.0855 0.0757 0.1197 0.1220 0.1437 0.1434 0.1426 0.1421
va: 1.2067 2.3509 1.9882 3.1820 3.8681 3.8992 4.2683 3.9232 3.9149 3.8817 3.6443 3.9899 3.9802 3.9602 3.9636 3.8426 1.0176 0.9965 1.0093 0.9950 1.0047 1.0092 1.0066 1.0084 1.0041 1.0151 1.0127 1.0109 1.0033 1.0031 1.0047 1.0049
dispcorr: -0.012917403 hartree
energy: -1455.414120266678
dipole: -40.10775 38.69091 -1.41684 -2.98695 2.09599 -0.89095 2.04466 -1.41258 0.63208
magnitude: 1.78907 au
magnitude: 4.54745 debye
