program: Orca
programVersion: 5.0.2
elementType: Cl S O N C C C C C C C C C C C C H H H H H H H H H H H H H H H H
charge: 0
multiplicity: 1
keywords: wb97x-d3
keywords: def2-TZVPP
keywords: def2/J RIJCOSX
keywords: DEFGRID2
keywords: scfconv7
keywords: smallprint printgap noloewdin
keywords: NOSOSCF
formula: C12H16ClNOS
InChI: InChI=1/C12H16ClNOS/c1-3-14(4-2)12(15)16-9-10-5-7-11(13)8-6-10/h5-8H,3-4,9H2,1-2H3
32 atoms
Cl 5.184893 -0.224216 1.144414
S  -1.254793 -0.401354 -1.366956
O  -1.796227 1.466913 0.420151
N  -2.945069 -0.463184 0.683195
C  -3.690179 0.10206 1.806408
C  -3.309492 -1.788795 0.20152
C  -2.055872 0.331423 0.064489
C  -4.858945 0.984314 1.399267
C  -4.384284 -1.793791 -0.87321
C  0.011523 0.854564 -1.727381
C  1.301716 0.602808 -1.008086
C  1.528174 1.105478 0.270616
C  2.301219 -0.158387 -1.607631
C  2.716665 0.853343 0.937912
C  3.496655 -0.419095 -0.955285
C  3.693936 0.091224 0.317507
H  -4.048314 -0.735466 2.404522
H  -3.00149 0.661852 2.438836
H  -2.414129 -2.30202 -0.154947
H  -3.649456 -2.360561 1.065097
H  -5.616251 0.425149 0.850432
H  -5.334246 1.3958 2.290844
H  -4.536982 1.82192 0.78127
H  -4.091795 -1.204827 -1.742667
H  -4.560423 -2.816186 -1.209644
H  -5.329362 -1.401784 -0.498515
H  -0.400213 1.837385 -1.50583
H  0.155614 0.797151 -2.806643
H  0.772649 1.705272 0.759635
H  2.150458 -0.557739 -2.603522
H  2.875766 1.253011 1.930457
H  4.2619 -1.011433 -1.438574
elementType: Cl S O N C H
totalener: -1455.39932305 hartree
nucrepener: 1295.72975340 hartree
electener: -2751.12907645 hartree
oneelecener: -4570.48377428 hartree
twoeener: 1819.35469783 hartree
cpcmener: -0.01855311 hartree
kineticenergy: 1451.33325457 hartree
xcener: -99.502443137813 hartree
chargesum: 0.0000000
charge: -0.100170 -0.123689 -0.517176 -0.131414 -0.015669 -0.043051 0.315020 -0.264537 -0.255281 -0.058854 0.031931 -0.194785 -0.221575 -0.134353 -0.122633 0.072145 0.091137 0.090216 0.096799 0.096595 0.086035 0.097178 0.087070 0.079350 0.097519 0.092124 0.129228 0.141582 0.152112 0.140685 0.142897 0.143564
qa: -0.1002 -0.1237 -0.5172 -0.1314 -0.0157 -0.0431 0.3150 -0.2645 -0.2553 -0.0589 0.0319 -0.1948 -0.2216 -0.1344 -0.1226 0.0721 0.0911 0.0902 0.0968 0.0966 0.0860 0.0972 0.0871 0.0793 0.0975 0.0921 0.1292 0.1416 0.1521 0.1407 0.1429 0.1436
va: 1.2042 2.3160 1.9793 3.2048 3.8542 3.8695 4.2578 3.9082 3.9011 3.7610 3.6111 3.9697 4.0284 3.9883 3.9466 3.8462 1.0042 1.0131 1.0136 1.0022 1.0010 1.0072 1.0117 1.0175 1.0096 1.0005 1.0318 1.0039 1.0166 1.0036 1.0054 1.0036
dispcorr: -0.013908903 hartree
energy: -1455.413231949578
dipole: -37.78840 36.19706 -1.59134 -2.15730 1.08970 -1.06760 -0.93421 0.59873 -0.33549
magnitude: 1.94543 au
magnitude: 4.94489 debye
