program: Orca
programVersion: 5.0.2
elementType: Cl S O N C C C C C C C C C C C C H H H H H H H H H H H H H H H H
charge: 0
multiplicity: 1
keywords: wb97x-d3
keywords: def2-TZVPP
keywords: def2/J RIJCOSX
keywords: DEFGRID2
keywords: scfconv7
keywords: smallprint printgap noloewdin
keywords: NOSOSCF
formula: C12H16ClNOS
InChI: InChI=1/C12H16ClNOS/c1-3-14(4-2)12(15)16-9-10-5-7-11(13)8-6-10/h5-8H,3-4,9H2,1-2H3
32 atoms
Cl 4.729359 -0.097905 1.76916
S  -1.246997 -0.346042 -1.674839
O  -1.964912 1.507486 0.068952
N  -3.168328 -0.404824 0.156826
C  -4.041072 0.137993 1.188064
C  -3.399588 -1.774953 -0.262431
C  -2.18853 0.386478 -0.328961
C  -3.487297 -0.055016 2.590563
C  -4.383363 -1.894071 -1.416696
C  0.052238 0.913095 -1.865187
C  1.223108 0.682401 -0.960032
C  2.26096 -0.155072 -1.355057
C  1.292954 1.279765 0.294476
C  3.34302 -0.400214 -0.526428
C  2.368858 1.043943 1.135126
C  3.386955 0.201276 0.720986
H  -4.210855 1.195616 0.992076
H  -5.009054 -0.357941 1.089728
H  -2.449787 -2.246993 -0.518593
H  -3.771612 -2.322463 0.606497
H  -4.190653 0.323363 3.332993
H  -3.309025 -1.108622 2.809639
H  -2.548364 0.482144 2.711739
H  -5.349156 -1.455862 -1.162606
H  -4.007384 -1.389663 -2.306134
H  -4.550116 -2.941555 -1.668776
H  -0.400305 1.891248 -1.71166
H  0.349245 0.844648 -2.912353
H  2.227591 -0.629809 -2.328502
H  0.494416 1.931055 0.622474
H  4.144113 -1.051649 -0.847107
H  2.414613 1.513943 2.107787
totalener: -1455.38268236 hartree
nucrepener: 1302.42052359 hartree
electener: -2757.80320595 hartree
oneelecener: -4583.37692311 hartree
twoeener: 1825.57371716 hartree
kineticenergy: 1451.36775317 hartree
xcener: -99.505760972017 hartree
chargesum: 0.0000000
charge: -0.084012 -0.112278 -0.436626 -0.130804 -0.037500 -0.086666 0.307630 -0.232662 -0.213991 -0.105182 0.047710 -0.189507 -0.160294 -0.110090 -0.117700 0.069075 0.092739 0.081139 0.095875 0.089531 0.084716 0.066886 0.095570 0.073396 0.082342 0.084548 0.132191 0.127167 0.106934 0.141320 0.118715 0.119827
qa: -0.0840 -0.1123 -0.4366 -0.1308 -0.0375 -0.0867 0.3076 -0.2327 -0.2140 -0.1052 0.0477 -0.1895 -0.1603 -0.1101 -0.1177 0.0691 0.0927 0.0811 0.0959 0.0895 0.0847 0.0669 0.0956 0.0734 0.0823 0.0845 0.1322 0.1272 0.1069 0.1413 0.1187 0.1198
va: 1.2223 2.3076 2.0614 3.1475 3.8919 3.9187 4.2607 3.9222 3.9084 3.8298 3.6438 4.0593 3.9905 3.9936 4.0014 3.9343 1.0175 0.9949 1.0196 0.9943 1.0096 1.0073 1.0111 1.0068 1.0182 1.0121 1.0298 1.0051 1.0120 1.0188 1.0119 1.0127
dispcorr: -0.013806655 hartree
energy: -1455.396489012742
dipole: -33.52382 32.35590 -1.16791 -4.98615 4.26824 -0.71791 -1.75438 1.46017 -0.29420
magnitude: 1.40213 au
magnitude: 3.56394 debye
