program: Orca
programVersion: 5.0.2
elementType: Cl S O N C C C C C C C C C C C C H H H H H H H H H H H H H H H H
charge: 0
multiplicity: 1
keywords: wb97x-d3
keywords: def2-TZVPP
keywords: def2/J RIJCOSX
keywords: DEFGRID2
keywords: scfconv7
keywords: smallprint printgap noloewdin
keywords: NOSOSCF
formula: C12H16ClNOS
InChI: InChI=1/C12H16ClNOS/c1-3-14(4-2)12(15)16-9-10-5-7-11(13)8-6-10/h5-8H,3-4,9H2,1-2H3
32 atoms
Cl 4.876988 0.171992 -1.815987
S  -1.309892 1.020257 1.143972
O  -1.427835 -1.621504 1.020798
N  -3.088027 -0.53639 -0.066708
C  -3.723984 0.696885 -0.492274
C  -3.707186 -1.78674 -0.480897
C  -1.962692 -0.592486 0.675554
C  -3.205719 1.202661 -1.829044
C  -4.718801 -2.301501 0.530607
C  0.225589 0.505696 1.973079
C  1.388921 0.41015 1.035126
C  2.139334 1.540958 0.73002
C  1.736678 -0.798127 0.440048
C  3.210122 1.478612 -0.145396
C  2.807099 -0.877068 -0.436713
C  3.538398 0.263472 -0.724505
H  -4.797947 0.506709 -0.549219
H  -3.610806 1.462468 0.277336
H  -4.188537 -1.611087 -1.445416
H  -2.930711 -2.530603 -0.650378
H  -2.142257 1.431678 -1.771382
H  -3.351157 0.462232 -2.616347
H  -3.731848 2.110446 -2.124987
H  -4.235449 -2.520207 1.481541
H  -5.512399 -1.574688 0.710354
H  -5.185369 -3.218858 0.171175
H  0.032822 -0.435744 2.484773
H  0.398937 1.267688 2.733893
H  1.884535 2.492369 1.181769
H  1.159468 -1.686535 0.657906
H  3.786595 2.364564 -0.372622
H  3.071238 -1.821316 -0.892446
totalener: -1455.38284482 hartree
nucrepener: 1299.75111809 hartree
electener: -2755.13396291 hartree
oneelecener: -4578.04520964 hartree
twoeener: 1822.91124673 hartree
kineticenergy: 1451.36533728 hartree
xcener: -99.505389581744 hartree
chargesum: 0.0000000
charge: -0.084355 -0.115487 -0.435759 -0.130319 -0.082344 -0.035889 0.306639 -0.212432 -0.234379 -0.104341 0.050482 -0.194369 -0.158361 -0.107414 -0.118058 0.068384 0.088221 0.091814 0.081165 0.093241 0.085300 0.072919 0.083113 0.095275 0.066459 0.085282 0.130718 0.129216 0.107858 0.138368 0.118542 0.120510
qa: -0.0844 -0.1155 -0.4358 -0.1303 -0.0823 -0.0359 0.3066 -0.2124 -0.2344 -0.1043 0.0505 -0.1944 -0.1584 -0.1074 -0.1181 0.0684 0.0882 0.0918 0.0812 0.0932 0.0853 0.0729 0.0831 0.0953 0.0665 0.0853 0.1307 0.1292 0.1079 0.1384 0.1185 0.1205
va: 1.2214 2.3065 2.0629 3.1526 3.9428 3.8854 4.2574 3.9089 3.9243 3.8249 3.6377 4.0624 3.9928 3.9919 4.0002 3.9320 0.9944 1.0097 0.9950 1.0198 1.0188 1.0065 1.0120 1.0094 1.0072 1.0097 1.0318 1.0041 1.0121 1.0204 1.0120 1.0123
dispcorr: -0.013740645 hartree
energy: -1455.396585465269
dipole: -34.50460 33.13364 -1.37096 -3.32751 3.75104 0.42354 1.61881 -1.70583 -0.08702
magnitude: 1.43753 au
magnitude: 3.65390 debye
